program: Orca
programVersion: 5.0.2
elementType: S S P O O C C C C C C C C C C C C C C H H H H H H H H H H H H H H H
charge: 0
multiplicity: 1
keywords: wb97x-d3
keywords: def2-TZVPP
keywords: def2/J RIJCOSX
keywords: DEFGRID2
keywords: scfconv7
keywords: smallprint printgap noloewdin
keywords: NOSOSCF
formula: C14H15O2PS2
InChI: InChI=1/C14H15O2PS2/c1-2-16-17(15,18-13-9-5-3-6-10-13)19-14-11-7-4-8-12-14/h3-12H,2H2,1H3
34 atoms
S  -0.385694 1.538151 1.899544
S  1.457906 -0.662461 0.211819
P  -0.508892 -0.200681 0.746839
O  -1.134404 0.212032 -0.662288
O  -1.216713 -1.253974 1.511664
C  0.078864 2.742865 0.675454
C  1.168117 -2.368499 -0.214175
C  -2.568315 0.355768 -0.805276
C  -0.911596 3.472346 0.026552
C  0.578182 -2.705539 -1.42744
C  1.422594 2.992737 0.421679
C  1.564705 -3.354839 0.680893
C  -3.16552 -0.888574 -1.411124
C  -0.5510 4.445075 -0.893648
C  0.377195 -4.042917 -1.736869
C  1.773762 3.964604 -0.504426
C  1.374242 -4.689671 0.354543
C  0.789345 4.68905 -1.16215
C  0.775982 -5.033881 -0.849705
H  -3.032021 0.587005 0.156802
H  -2.711355 1.219274 -1.453561
H  -1.955808 3.286684 0.242006
H  0.281515 -1.935109 -2.126694
H  2.191683 2.439772 0.945517
H  2.019279 -3.084166 1.62482
H  -3.024425 -1.757476 -0.768298
H  -4.23813 -0.741299 -1.54428
H  -2.735158 -1.10278 -2.389639
H  -1.320215 5.01474 -1.398558
H  -0.088026 -4.309849 -2.676806
H  2.819082 4.157682 -0.706834
H  1.68736 -5.459755 1.047308
H  1.066427 5.449361 -1.880696
H  0.621302 -6.07589 -1.097975
elementType: S P O C H
totalener: -1830.90554222 hartree
nucrepener: 1871.67031594 hartree
electener: -3702.57585816 hartree
oneelecener: -6238.75393186 hartree
twoeener: 2536.17807370 hartree
cpcmener: -0.02749184 hartree
kineticenergy: 1825.73239871 hartree
xcener: -123.388840438757 hartree
chargesum: -0.0000000
charge: -0.134440 -0.154538 0.677517 -0.328667 -0.611943 0.041427 0.090346 0.043124 -0.118264 -0.134951 -0.106025 -0.122685 -0.255971 -0.170198 -0.170770 -0.175946 -0.169964 -0.114725 -0.114979 0.100927 0.105625 0.151221 0.149534 0.148928 0.140252 0.086057 0.102176 0.089440 0.159032 0.159092 0.159283 0.158685 0.160798 0.160604
qa: -0.1344 -0.1545 0.6775 -0.3287 -0.6119 0.0414 0.0903 0.0431 -0.1183 -0.1350 -0.1060 -0.1227 -0.2560 -0.1702 -0.1708 -0.1759 -0.1700 -0.1147 -0.1150 0.1009 0.1056 0.1512 0.1495 0.1489 0.1403 0.0861 0.1022 0.0894 0.1590 0.1591 0.1593 0.1587 0.1608 0.1606
va: 2.3247 2.2947 5.4037 2.0717 1.9909 3.7323 3.7211 3.8402 3.8994 3.9061 3.9006 3.9559 3.9591 3.9387 3.9304 3.9516 3.9372 3.8814 3.8741 1.0002 0.9897 0.9940 1.0048 1.0005 1.0068 1.0163 1.0084 1.0028 0.9904 0.9903 0.9901 0.9897 0.9878 0.9880
dispcorr: -0.017362941 hartree
energy: -1830.922905161157
dipole: -7.72185 7.60150 -0.12035 -1.93695 2.87710 0.94015 -12.42569 10.49501 -1.93068
magnitude: 2.15079 au
magnitude: 5.46687 debye
