program: Orca
programVersion: 5.0.2
elementType: S S P O O C C C C C C C C C C C C C C H H H H H H H H H H H H H H H
charge: 0
multiplicity: 1
keywords: wb97x-d3
keywords: def2-TZVPP
keywords: def2/J RIJCOSX
keywords: DEFGRID2
keywords: scfconv7
keywords: smallprint printgap noloewdin
keywords: NOSOSCF
formula: C14H15O2PS2
InChI: InChI=1/C14H15O2PS2/c1-2-16-17(15,18-13-9-5-3-6-10-13)19-14-11-7-4-8-12-14/h3-12H,2H2,1H3
34 atoms
S  -0.524361 1.76732 1.8682
S  1.358422 -0.702846 0.782709
P  -0.635497 -0.120147 0.97797
O  -1.070198 0.081643 -0.541889
O  -1.48999 -1.009048 1.800354
C  0.097875 2.759316 0.52755
C  1.039624 -2.274219 0.005001
C  -2.437715 -0.119416 -0.971709
C  -0.803188 3.382915 -0.328776
C  0.797197 -3.390478 0.797817
C  1.465359 2.96539 0.387522
C  1.047781 -2.376302 -1.381471
C  -2.601235 -1.491263 -1.574996
C  -0.328622 4.208717 -1.336761
C  0.564413 -4.617579 0.194899
C  1.931123 3.791174 -0.625888
C  0.811654 -3.607839 -1.974902
C  1.03676 4.411342 -1.487329
C  0.569823 -4.726658 -1.189093
H  -3.129301 0.032779 -0.141029
H  -2.629024 0.660803 -1.707396
H  -1.867428 3.230174 -0.204807
H  0.797444 -3.303738 1.876252
H  2.164005 2.492022 1.065087
H  1.234154 -1.503069 -1.992494
H  -3.626226 -1.606702 -1.930318
H  -1.936144 -1.634207 -2.426909
H  -2.40994 -2.278068 -0.844543
H  -1.028365 4.695923 -2.00325
H  0.378551 -5.488567 0.809513
H  2.995375 3.951124 -0.738971
H  0.813809 -3.691235 -3.053873
H  1.403817 5.056973 -2.274636
H  0.385999 -5.685674 -1.655673
elementType: S P O C H
totalener: -1830.90662316 hartree
nucrepener: 1884.98742035 hartree
electener: -3715.89404351 hartree
oneelecener: -6265.31584093 hartree
twoeener: 2549.42179742 hartree
cpcmener: -0.02619984 hartree
kineticenergy: 1825.72819322 hartree
xcener: -123.389814474623 hartree
chargesum: -0.0000000
charge: -0.139384 -0.153633 0.679492 -0.333626 -0.613629 0.059659 0.138849 0.054122 -0.127828 -0.153401 -0.111130 -0.171505 -0.255302 -0.165991 -0.153656 -0.172246 -0.147905 -0.120211 -0.130403 0.099856 0.102099 0.144162 0.143220 0.146984 0.142504 0.106107 0.088056 0.085224 0.159399 0.159467 0.159134 0.159958 0.161265 0.160293
qa: -0.1394 -0.1536 0.6795 -0.3336 -0.6136 0.0597 0.1388 0.0541 -0.1278 -0.1534 -0.1111 -0.1715 -0.2553 -0.1660 -0.1537 -0.1722 -0.1479 -0.1202 -0.1304 0.0999 0.1021 0.1442 0.1432 0.1470 0.1425 0.1061 0.0881 0.0852 0.1594 0.1595 0.1591 0.1600 0.1613 0.1603
va: 2.3200 2.2894 5.4221 2.0826 1.9925 3.7058 3.6515 3.8338 3.9195 3.9682 3.9089 3.9214 3.9360 3.9298 3.9204 3.9445 3.8851 3.8808 3.8881 1.0043 0.9921 1.0002 1.0067 1.0001 1.0093 1.0108 1.0010 1.0111 0.9897 0.9895 0.9901 0.9887 0.9878 0.9886
dispcorr: -0.018126049 hartree
energy: -1830.924749207989
dipole: -5.46020 5.62395 0.16375 -4.58601 5.05456 0.46855 -15.74235 13.26886 -2.47349
magnitude: 2.52280 au
magnitude: 6.41245 debye
