program: Orca
programVersion: 5.0.2
elementType: S S P O O C C C C C C C C C C C C C C H H H H H H H H H H H H H H H
charge: 0
multiplicity: 1
keywords: wb97x-d3
keywords: def2-TZVPP
keywords: def2/J RIJCOSX
keywords: DEFGRID2
keywords: scfconv7
keywords: smallprint printgap noloewdin
keywords: NOSOSCF
formula: C14H15O2PS2
InChI: InChI=1/C14H15O2PS2/c1-2-16-17(15,18-13-9-5-3-6-10-13)19-14-11-7-4-8-12-14/h3-12H,2H2,1H3
34 atoms
S  1.101668 0.793116 0.981477
S  -0.406733 -2.066192 1.557784
P  -0.768984 -0.124855 0.873726
O  -1.020746 -0.203054 -0.698212
O  -1.848368 0.503686 1.675013
C  0.58471 2.373069 0.344451
C  0.586369 -2.719205 0.233327
C  -2.363703 -0.181775 -1.238964
C  0.039315 3.314803 1.210022
C  1.973703 -2.661649 0.308946
C  0.736492 2.654463 -1.008058
C  -0.037276 -3.338508 -0.844091
C  -2.749507 1.220223 -1.63431
C  -0.359162 4.547339 0.713152
C  2.737244 -3.210945 -0.711555
C  0.334708 3.889934 -1.495284
C  0.733678 -3.888626 -1.857204
C  -0.214301 4.834188 -0.637618
C  2.119396 -3.822058 -1.793831
H  -2.33667 -0.843304 -2.104273
H  -3.072915 -0.602684 -0.523977
H  -0.069866 3.089847 2.262769
H  2.45766 -2.195604 1.157134
H  1.160865 1.916282 -1.675986
H  -1.117035 -3.394128 -0.889961
H  -3.74506 1.206199 -2.080616
H  -2.779697 1.889538 -0.773816
H  -2.059786 1.630562 -2.372139
H  -0.784355 5.282794 1.38377
H  3.817313 -3.162418 -0.657098
H  0.449042 4.112999 -2.548106
H  0.249985 -4.370497 -2.696777
H  -0.528341 5.796199 -1.022294
H  2.718153 -4.251469 -2.586911
elementType: S P O C H
totalener: -1830.90667508 hartree
nucrepener: 1888.57268898 hartree
electener: -3719.47936406 hartree
oneelecener: -6272.50975424 hartree
twoeener: 2553.03039018 hartree
cpcmener: -0.02608469 hartree
kineticenergy: 1825.72389076 hartree
xcener: -123.389428509885 hartree
chargesum: 0.0000000
charge: -0.151623 -0.138753 0.680125 -0.334064 -0.614988 0.139981 0.060355 0.053540 -0.153248 -0.115517 -0.170211 -0.125935 -0.257047 -0.154737 -0.171790 -0.149302 -0.166799 -0.128392 -0.120165 0.103380 0.099680 0.143125 0.147631 0.141752 0.144821 0.105628 0.085710 0.087639 0.159482 0.159731 0.159409 0.158781 0.160084 0.161716
qa: -0.1516 -0.1388 0.6801 -0.3341 -0.6150 0.1400 0.0604 0.0535 -0.1532 -0.1155 -0.1702 -0.1259 -0.2570 -0.1547 -0.1718 -0.1493 -0.1668 -0.1284 -0.1202 0.1034 0.0997 0.1431 0.1476 0.1418 0.1448 0.1056 0.0857 0.0876 0.1595 0.1597 0.1594 0.1588 0.1601 0.1617
va: 2.2926 2.3195 5.4172 2.0815 1.9899 3.6537 3.7057 3.8326 3.9640 3.9036 3.9287 3.9219 3.9348 3.9207 3.9443 3.8866 3.9307 3.8855 3.8816 0.9923 1.0044 1.0073 1.0004 1.0091 0.9991 1.0112 1.0130 1.0015 0.9896 0.9898 0.9889 0.9900 0.9886 0.9876
dispcorr: -0.018171345 hartree
energy: -1830.924846428590
dipole: -4.51396 5.05606 0.54211 5.77601 -5.86724 -0.09122 -15.36430 12.93024 -2.43406
magnitude: 2.49536 au
magnitude: 6.34271 debye
