program: Orca
programVersion: 5.0.2
elementType: S S P O O C C C C C C C C C C C C C C H H H H H H H H H H H H H H H
charge: 0
multiplicity: 1
keywords: wb97x-d3
keywords: def2-TZVPP
keywords: def2/J RIJCOSX
keywords: DEFGRID2
keywords: scfconv7
keywords: smallprint printgap noloewdin
keywords: NOSOSCF
formula: C14H15O2PS2
InChI: InChI=1/C14H15O2PS2/c1-2-16-17(15,18-13-9-5-3-6-10-13)19-14-11-7-4-8-12-14/h3-12H,2H2,1H3
34 atoms
S  -0.624594 1.000781 -1.158153
S  -1.051807 -2.29417 -0.691211
P  -1.371891 -0.426832 0.189085
O  -2.954705 -0.406604 0.005244
O  -0.8155 -0.256309 1.551782
C  0.457872 1.909012 -0.080519
C  0.723935 -2.266881 -0.565203
C  -3.759896 0.780865 0.18379
C  0.012069 3.0889 0.502376
C  1.479114 -1.982467 -1.69737
C  1.7564 1.459999 0.1305
C  1.343553 -2.538025 0.649469
C  -3.68325 1.362351 1.574316
C  0.872079 3.820236 1.308627
C  2.863824 -1.967051 -1.609476
C  2.607714 2.195743 0.940029
C  2.727609 -2.509585 0.729986
C  2.167582 3.374025 1.528623
C  3.487746 -2.224236 -0.396702
H  -3.472171 1.520197 -0.566742
H  -4.773737 0.456217 -0.042198
H  -0.998287 3.43533 0.329335
H  0.991376 -1.772752 -2.639942
H  2.099096 0.542648 -0.331317
H  0.752758 -2.77271 1.524667
H  -3.901727 0.615589 2.336767
H  -2.713446 1.808734 1.789299
H  -4.4305 2.151245 1.657978
H  0.526705 4.738082 1.766195
H  3.453331 -1.747845 -2.490126
H  3.617604 1.846533 1.109666
H  3.211754 -2.713776 1.675808
H  2.83511 3.944515 2.160267
H  4.567635 -2.204997 -0.329225
elementType: S P O C H
totalener: -1830.90450760 hartree
nucrepener: 1911.68493291 hartree
electener: -3742.58944050 hartree
oneelecener: -6319.01717336 hartree
twoeener: 2576.42773286 hartree
cpcmener: -0.02561822 hartree
kineticenergy: 1825.74528397 hartree
xcener: -123.396013984302 hartree
chargesum: 0.0000000
charge: -0.161370 -0.132800 0.697772 -0.348525 -0.592028 0.001930 0.064285 0.015706 -0.067437 -0.130925 -0.003978 -0.128912 -0.237594 -0.212036 -0.140820 -0.249589 -0.167178 -0.072444 -0.128372 0.100575 0.111076 0.146450 0.137110 0.135847 0.140968 0.097631 0.079912 0.097353 0.158173 0.157200 0.153126 0.159330 0.159820 0.159744
qa: -0.1614 -0.1328 0.6978 -0.3485 -0.5920 0.0019 0.0643 0.0157 -0.0674 -0.1309 -0.0040 -0.1289 -0.2376 -0.2120 -0.1408 -0.2496 -0.1672 -0.0724 -0.1284 0.1006 0.1111 0.1465 0.1371 0.1358 0.1410 0.0976 0.0799 0.0974 0.1582 0.1572 0.1531 0.1593 0.1598 0.1597
va: 2.3013 2.3151 5.3913 2.1184 1.9864 3.7535 3.6789 3.8776 3.8429 3.9029 3.7390 3.9268 3.8973 3.9755 3.8837 4.0042 3.9222 3.8269 3.8679 1.0001 0.9903 0.9938 1.0123 0.9815 1.0112 1.0066 1.0103 1.0076 0.9909 0.9906 0.9955 0.9903 0.9877 0.9893
dispcorr: -0.018945245 hartree
energy: -1830.923452843199
dipole: 2.78839 -2.26674 0.52166 9.70160 -8.55215 1.14945 6.60775 -7.10636 -0.49862
magnitude: 1.35719 au
magnitude: 3.44971 debye
