program: Orca
programVersion: 5.0.2
elementType: S S P O O C C C C C C C C C C C C C C H H H H H H H H H H H H H H H
charge: 0
multiplicity: 1
keywords: wb97x-d3
keywords: def2-TZVPP
keywords: def2/J RIJCOSX
keywords: DEFGRID2
keywords: scfconv7
keywords: smallprint printgap noloewdin
keywords: NOSOSCF
formula: C14H15O2PS2
InChI: InChI=1/C14H15O2PS2/c1-2-16-17(15,18-13-9-5-3-6-10-13)19-14-11-7-4-8-12-14/h3-12H,2H2,1H3
34 atoms
S  -1.24437 1.953662 -0.686618
S  0.492146 -0.752457 -1.346202
P  -0.77152 0.073427 0.090472
O  -2.136526 -0.72013 -0.133272
O  -0.225956 0.080504 1.468435
C  0.260681 2.792858 -0.238474
C  0.827915 -2.266115 -0.468255
C  -3.101807 -0.850303 0.940648
C  1.250251 2.969102 -1.19854
C  1.88785 -2.324343 0.428874
C  0.423695 3.292459 1.048717
C  0.028157 -3.380299 -0.696752
C  -2.908922 -2.150114 1.677472
C  2.415873 3.64268 -0.863058
C  2.149102 -3.510896 1.097807
C  1.593629 3.962211 1.375114
C  0.296463 -4.561938 -0.021034
C  2.58944 4.135256 0.422926
C  1.354998 -4.627886 0.874518
H  -3.039397 0.001734 1.620953
H  -4.07667 -0.810734 0.45654
H  1.113606 2.583603 -2.200447
H  2.505737 -1.453107 0.601093
H  -0.354741 3.164597 1.788934
H  -0.796652 -3.327157 -1.395153
H  -1.936189 -2.196689 2.166933
H  -3.675307 -2.23953 2.448913
H  -3.006958 -3.006832 1.010484
H  3.189001 3.777521 -1.608046
H  2.974254 -3.561055 1.796134
H  1.726983 4.34832 2.377235
H  -0.325276 -5.430473 -0.194633
H  3.501361 4.656841 0.683362
H  1.561997 -5.551601 1.399171
elementType: S P O C H
totalener: -1830.90718805 hartree
nucrepener: 1872.11442609 hartree
electener: -3703.02161415 hartree
oneelecener: -6240.14715925 hartree
twoeener: 2537.12554510 hartree
cpcmener: -0.02496322 hartree
kineticenergy: 1825.74070803 hartree
xcener: -123.391205250440 hartree
chargesum: 0.0000000
charge: -0.144882 -0.143903 0.694861 -0.356634 -0.600032 0.101060 0.138638 0.047343 -0.139455 -0.164631 -0.145153 -0.168539 -0.254072 -0.161630 -0.146192 -0.154765 -0.150584 -0.129995 -0.132273 0.097619 0.107498 0.142627 0.142688 0.141232 0.142782 0.085326 0.104657 0.087231 0.158975 0.159741 0.159553 0.159605 0.160605 0.160700
qa: -0.1449 -0.1439 0.6949 -0.3566 -0.6000 0.1011 0.1386 0.0473 -0.1395 -0.1646 -0.1452 -0.1685 -0.2541 -0.1616 -0.1462 -0.1548 -0.1506 -0.1300 -0.1323 0.0976 0.1075 0.1426 0.1427 0.1412 0.1428 0.0853 0.1047 0.0872 0.1590 0.1597 0.1596 0.1596 0.1606 0.1607
va: 2.3112 2.2982 5.4216 2.0908 1.9875 3.6885 3.6650 3.8533 3.9401 3.9750 3.9605 3.9340 3.9227 3.9339 3.9070 3.9175 3.9057 3.8873 3.8921 1.0028 0.9929 1.0052 1.0053 1.0069 1.0095 1.0153 1.0097 1.0025 0.9896 0.9889 0.9892 0.9893 0.9883 0.9886
dispcorr: -0.017045152 hartree
energy: -1830.924233205582
dipole: -0.87401 0.76655 -0.10746 -8.03911 7.50984 -0.52927 9.31295 -9.20642 0.10652
magnitude: 0.55047 au
magnitude: 1.39919 debye
