program: Orca
programVersion: 5.0.2
elementType: S S P O O C C C C C C C C C C C C C C H H H H H H H H H H H H H H H
charge: 0
multiplicity: 1
keywords: wb97x-d3
keywords: def2-TZVPP
keywords: def2/J RIJCOSX
keywords: DEFGRID2
keywords: scfconv7
keywords: smallprint printgap noloewdin
keywords: NOSOSCF
formula: C14H15O2PS2
InChI: InChI=1/C14H15O2PS2/c1-2-16-17(15,18-13-9-5-3-6-10-13)19-14-11-7-4-8-12-14/h3-12H,2H2,1H3
34 atoms
S  0.161422 1.039306 -1.120083
S  -0.118117 -1.13973 1.495604
P  -1.159467 0.167282 0.252474
O  -1.978795 -0.807147 -0.704803
O  -1.90316 1.14267 1.082466
C  0.748688 2.379219 -0.108403
C  0.584363 -2.263927 0.310015
C  -3.046525 -0.29793 -1.543379
C  0.113247 3.613775 -0.178754
C  -0.134606 -3.392197 -0.069999
C  1.862445 2.202275 0.704372
C  1.868428 -2.045079 -0.175371
C  -4.379134 -0.419269 -0.85034
C  0.599572 4.676666 0.567706
C  0.43531 -4.300721 -0.948917
C  2.335335 3.268744 1.456249
C  2.43012 -2.959483 -1.055332
C  1.706401 4.504205 1.388036
C  1.715502 -4.08473 -1.442321
H  -2.844001 0.736121 -1.833526
H  -3.013197 -0.903643 -2.447565
H  -0.750781 3.745753 -0.816241
H  -1.129206 -3.562904 0.320322
H  2.358558 1.241707 0.751678
H  2.426368 -1.17036 0.13179
H  -5.168147 -0.114776 -1.538625
H  -4.578552 -1.447547 -0.549079
H  -4.438313 0.220759 0.029507
H  0.108896 5.639514 0.510778
H  -0.121632 -5.179632 -1.24645
H  3.197719 3.132268 2.095427
H  3.429112 -2.791355 -1.435956
H  2.082204 5.335507 1.970582
H  2.158626 -4.797223 -2.126001
elementType: S P O C H
totalener: -1830.90651049 hartree
nucrepener: 1874.17161378 hartree
electener: -3705.07812427 hartree
oneelecener: -6243.83085421 hartree
twoeener: 2538.75272994 hartree
cpcmener: -0.02681378 hartree
kineticenergy: 1825.73431356 hartree
xcener: -123.391666360383 hartree
chargesum: -0.0000000
charge: -0.164332 -0.131645 0.695451 -0.343129 -0.612820 0.055694 0.013435 0.044387 -0.106565 -0.092831 -0.078313 -0.090088 -0.241803 -0.181957 -0.185962 -0.206918 -0.197712 -0.100162 -0.101193 0.093269 0.107481 0.140869 0.140015 0.154187 0.172686 0.093908 0.089169 0.081296 0.158582 0.158730 0.156512 0.157511 0.160926 0.161321
qa: -0.1643 -0.1316 0.6955 -0.3431 -0.6128 0.0557 0.0134 0.0444 -0.1066 -0.0928 -0.0783 -0.0901 -0.2418 -0.1820 -0.1860 -0.2069 -0.1977 -0.1002 -0.1012 0.0933 0.1075 0.1409 0.1400 0.1542 0.1727 0.0939 0.0892 0.0813 0.1586 0.1587 0.1565 0.1575 0.1609 0.1613
va: 2.2854 2.3134 5.4087 2.0954 1.9977 3.7149 3.7359 3.8594 3.9321 3.8983 3.8470 3.8318 3.9401 3.9396 3.9365 3.9825 3.9664 3.8544 3.8614 1.0025 0.9916 1.0001 1.0066 0.9864 0.9701 1.0077 1.0033 1.0197 0.9898 0.9900 0.9939 0.9936 0.9878 0.9876
dispcorr: -0.016949161 hartree
energy: -1830.923459647946
dipole: -4.03445 4.81325 0.77880 -0.82543 0.18512 -0.64031 -5.87475 4.36738 -1.50737
magnitude: 1.81347 au
magnitude: 4.60949 debye
