program: Orca
programVersion: 5.0.2
elementType: S S P O O C C C C C C C C C C C C C C H H H H H H H H H H H H H H H
charge: 0
multiplicity: 1
keywords: wb97x-d3
keywords: def2-TZVPP
keywords: def2/J RIJCOSX
keywords: DEFGRID2
keywords: scfconv7
keywords: smallprint printgap noloewdin
keywords: NOSOSCF
formula: C14H15O2PS2
InChI: InChI=1/C14H15O2PS2/c1-2-16-17(15,18-13-9-5-3-6-10-13)19-14-11-7-4-8-12-14/h3-12H,2H2,1H3
34 atoms
S  -1.13246 2.043768 -0.501973
S  0.559849 -0.581833 -1.526018
P  -0.668063 0.075366 0.027922
O  -2.037781 -0.68476 -0.272127
O  -0.101845 -0.08397 1.388667
C  0.285992 2.849724 0.209698
C  0.7772 -2.239623 -0.908058
C  -2.962994 -0.99668 0.799415
C  0.255901 3.241497 1.543119
C  -0.094289 -3.240996 -1.321757
C  1.400577 3.107099 -0.580011
C  1.804061 -2.516581 -0.012763
C  -2.720042 -2.38619 1.330933
C  1.353416 3.891317 2.08751
C  0.062743 -4.528136 -0.828195
C  2.495052 3.755067 -0.02548
C  1.954907 -3.807422 0.472341
C  2.472879 4.145943 1.306042
C  1.083196 -4.810662 0.069634
H  -2.895564 -0.251331 1.594678
H  -3.953357 -0.912127 0.353926
H  -0.616919 3.043457 2.151237
H  -0.890465 -3.018606 -2.019913
H  1.416461 2.805356 -1.619148
H  2.479471 -1.73219 0.302286
H  -1.735828 -2.47831 1.790634
H  -3.467536 -2.610702 2.093546
H  -2.811209 -3.136545 0.545239
H  1.333256 4.197265 3.125351
H  -0.616836 -5.308937 -1.144009
H  3.365491 3.9528 -0.637483
H  2.751794 -4.026901 1.170827
H  3.32842 4.651088 1.735307
H  1.200166 -5.815092 0.455643
elementType: S P O C H
totalener: -1830.90697619 hartree
nucrepener: 1870.60311728 hartree
electener: -3701.51009347 hartree
oneelecener: -6237.11309776 hartree
twoeener: 2535.60300428 hartree
cpcmener: -0.02512790 hartree
kineticenergy: 1825.72776339 hartree
xcener: -123.388724360203 hartree
chargesum: -0.0000000
charge: -0.147143 -0.143744 0.694845 -0.355272 -0.600200 0.091682 0.143428 0.046959 -0.141032 -0.173466 -0.126840 -0.169227 -0.255882 -0.157048 -0.148197 -0.169011 -0.142445 -0.125114 -0.135848 0.098886 0.107360 0.141524 0.142398 0.143980 0.142585 0.085785 0.106067 0.086441 0.159092 0.159882 0.159145 0.159730 0.160305 0.160373
qa: -0.1471 -0.1437 0.6948 -0.3553 -0.6002 0.0917 0.1434 0.0470 -0.1410 -0.1735 -0.1268 -0.1692 -0.2559 -0.1570 -0.1482 -0.1690 -0.1424 -0.1251 -0.1358 0.0989 0.1074 0.1415 0.1424 0.1440 0.1426 0.0858 0.1061 0.0864 0.1591 0.1599 0.1591 0.1597 0.1603 0.1604
va: 2.3085 2.2981 5.4161 2.0902 1.9888 3.6984 3.6561 3.8537 3.9594 3.9355 3.9343 3.9763 3.9210 3.9203 3.8933 3.9404 3.9063 3.8830 3.8941 1.0023 0.9928 1.0039 1.0107 1.0031 1.0061 1.0146 1.0102 1.0018 0.9893 0.9890 0.9898 0.9890 0.9883 0.9887
dispcorr: -0.017269476 hartree
energy: -1830.924245669694
dipole: -1.46663 1.23105 -0.23558 -9.41383 8.83338 -0.58044 8.76685 -8.62817 0.13868
magnitude: 0.64159 au
magnitude: 1.63080 debye
