program: Orca
programVersion: 5.0.2
elementType: S S P O O C C C C C C C C C C C C C C H H H H H H H H H H H H H H H
charge: 0
multiplicity: 1
keywords: wb97x-d3
keywords: def2-TZVPP
keywords: def2/J RIJCOSX
keywords: DEFGRID2
keywords: scfconv7
keywords: smallprint printgap noloewdin
keywords: NOSOSCF
formula: C14H15O2PS2
InChI: InChI=1/C14H15O2PS2/c1-2-16-17(15,18-13-9-5-3-6-10-13)19-14-11-7-4-8-12-14/h3-12H,2H2,1H3
34 atoms
S  -1.095586 2.091229 -0.732554
S  0.535858 -0.649905 -1.439189
P  -0.810254 0.135624 -0.05243
O  -2.19668 -0.552412 -0.439054
O  -0.385098 0.016191 1.362677
C  0.331881 2.825809 0.037833
C  0.762116 -2.231386 -0.651891
C  -3.163145 -0.899339 0.583934
C  1.533309 2.909273 -0.656388
C  -0.010001 -3.314812 -1.055456
C  0.218734 3.342021 1.32348
C  1.706234 -2.369647 0.359511
C  -2.91273 -2.284302 1.123882
C  2.629518 3.508027 -0.052104
C  0.162765 -4.543767 -0.434589
C  1.317851 3.944364 1.916509
C  1.871179 -3.601816 0.973855
C  2.522882 4.025533 1.231556
C  1.098173 -4.686761 0.581002
H  -3.156472 -0.154087 1.381566
H  -4.130543 -0.840708 0.087282
H  1.615795 2.511495 -1.659421
H  -0.740958 -3.201275 -1.845355
H  -0.72106 3.277863 1.855487
H  2.308272 -1.523614 0.663586
H  -2.936493 -3.032355 0.331275
H  -1.956358 -2.352637 1.642383
H  -3.697739 -2.533923 1.839345
H  3.568083 3.568625 -0.587474
H  -0.438182 -5.388867 -0.744119
H  1.231781 4.348496 2.916628
H  2.603193 -3.712569 1.763139
H  3.37992 4.493053 1.698768
H  1.227465 -5.645952 1.06534
elementType: S P O C H
totalener: -1830.90675936 hartree
nucrepener: 1874.40537285 hartree
electener: -3705.31213221 hartree
oneelecener: -6244.71812750 hartree
twoeener: 2539.40599529 hartree
cpcmener: -0.02490469 hartree
kineticenergy: 1825.73606545 hartree
xcener: -123.390794657959 hartree
chargesum: -0.0000000
charge: -0.146723 -0.145934 0.699761 -0.358667 -0.600658 0.089666 0.140378 0.048432 -0.129724 -0.169681 -0.137293 -0.165569 -0.258479 -0.169060 -0.150961 -0.159079 -0.145610 -0.123815 -0.131879 0.098958 0.107294 0.145954 0.143028 0.140514 0.142236 0.087125 0.085481 0.106753 0.158692 0.159654 0.159192 0.159716 0.159926 0.160372
qa: -0.1467 -0.1459 0.6998 -0.3587 -0.6007 0.0897 0.1404 0.0484 -0.1297 -0.1697 -0.1373 -0.1656 -0.2585 -0.1691 -0.1510 -0.1591 -0.1456 -0.1238 -0.1319 0.0990 0.1073 0.1460 0.1430 0.1405 0.1422 0.0871 0.0855 0.1068 0.1587 0.1597 0.1592 0.1597 0.1599 0.1604
va: 2.3091 2.2991 5.4097 2.0914 1.9858 3.7004 3.6543 3.8519 3.9340 3.9283 3.9649 3.9700 3.9170 3.9421 3.8985 3.9221 3.9089 3.8828 3.8909 1.0032 0.9925 1.0016 1.0090 1.0048 1.0055 1.0017 1.0140 1.0106 0.9902 0.9891 0.9893 0.9890 0.9884 0.9886
dispcorr: -0.017368194 hartree
energy: -1830.924127554330
dipole: -1.48109 1.37396 -0.10713 -9.34634 8.71442 -0.63193 9.14891 -8.96059 0.18832
magnitude: 0.66803 au
magnitude: 1.69801 debye
