program: Orca
programVersion: 5.0.2
elementType: S S P O O C C C C C C C C C C C C C C H H H H H H H H H H H H H H H
charge: 0
multiplicity: 1
keywords: wb97x-d3
keywords: def2-TZVPP
keywords: def2/J RIJCOSX
keywords: DEFGRID2
keywords: scfconv7
keywords: smallprint printgap noloewdin
keywords: NOSOSCF
formula: C14H15O2PS2
InChI: InChI=1/C14H15O2PS2/c1-2-16-17(15,18-13-9-5-3-6-10-13)19-14-11-7-4-8-12-14/h3-12H,2H2,1H3
34 atoms
S  -1.333562 2.099474 -0.51824
S  0.134874 -0.634037 -1.482039
P  -0.89509 0.167185 0.149713
O  -2.33542 -0.515711 0.104436
O  -0.173301 0.094341 1.442268
C  0.218371 2.852676 -0.071638
C  0.61977 -2.185291 -0.755332
C  -2.951286 -1.055892 1.297358
C  0.382181 3.353102 1.215215
C  1.737621 -2.243488 0.069788
C  1.239142 2.956868 -1.00896
C  -0.102679 -3.334961 -1.053908
C  -2.436685 -2.437457 1.613432
C  1.580575 3.956059 1.565291
C  2.13004 -3.463348 0.599441
C  2.436128 3.559931 -0.648112
C  0.301219 -4.551673 -0.52304
C  2.607698 4.057218 0.636362
C  1.414038 -4.616131 0.303886
H  -2.806147 -0.374562 2.137394
H  -4.016184 -1.07936 1.071819
H  -0.420352 3.274339 1.93659
H  2.300789 -1.346314 0.290091
H  1.106096 2.570107 -2.010878
H  -0.971653 -3.281267 -1.696574
H  -2.955176 -2.8149 2.49613
H  -2.623578 -3.131562 0.794239
H  -1.368849 -2.435709 1.833732
H  1.710788 4.34432 2.566929
H  2.999101 -3.512527 1.242357
H  3.235869 3.638092 -1.372918
H  -0.257026 -5.449224 -0.755248
H  3.543211 4.525252 0.914066
H  1.726814 -5.566466 0.716561
elementType: S P O C H
totalener: -1830.90580478 hartree
nucrepener: 1875.22226845 hartree
electener: -3706.12807323 hartree
oneelecener: -6246.29032820 hartree
twoeener: 2540.16225497 hartree
cpcmener: -0.02429905 hartree
kineticenergy: 1825.73510151 hartree
xcener: -123.391158209310 hartree
chargesum: 0.0000000
charge: -0.148561 -0.146908 0.705358 -0.359756 -0.599377 0.094122 0.125356 0.050175 -0.141715 -0.151079 -0.134751 -0.163066 -0.256612 -0.157363 -0.153461 -0.166592 -0.151391 -0.126203 -0.127589 0.099318 0.106870 0.139999 0.140579 0.144374 0.143866 0.106378 0.088852 0.080667 0.159288 0.159742 0.159016 0.159401 0.160811 0.160250
qa: -0.1486 -0.1469 0.7054 -0.3598 -0.5994 0.0941 0.1254 0.0502 -0.1417 -0.1511 -0.1348 -0.1631 -0.2566 -0.1574 -0.1535 -0.1666 -0.1514 -0.1262 -0.1276 0.0993 0.1069 0.1400 0.1406 0.1444 0.1439 0.1064 0.0889 0.0807 0.1593 0.1597 0.1590 0.1594 0.1608 0.1603
va: 2.3060 2.3046 5.3977 2.0955 1.9867 3.6943 3.6511 3.8519 3.9652 3.9597 3.9387 3.9143 3.9193 3.9229 3.9166 3.9383 3.9012 3.8847 3.8853 1.0033 0.9915 1.0060 1.0068 1.0032 1.0078 1.0110 1.0010 1.0123 0.9892 0.9892 0.9898 0.9890 0.9881 0.9885
dispcorr: -0.017513265 hartree
energy: -1830.923318040731
dipole: 1.70901 -1.63852 0.07049 -10.04573 9.24715 -0.79858 8.87222 -8.68254 0.18968
magnitude: 0.82382 au
magnitude: 2.09397 debye
