program: Orca
programVersion: 5.0.2
elementType: S S P O O C C C C C C C C C C C C C C H H H H H H H H H H H H H H H
charge: 0
multiplicity: 1
keywords: wb97x-d3
keywords: def2-TZVPP
keywords: def2/J RIJCOSX
keywords: DEFGRID2
keywords: scfconv7
keywords: smallprint printgap noloewdin
keywords: NOSOSCF
formula: C14H15O2PS2
InChI: InChI=1/C14H15O2PS2/c1-2-16-17(15,18-13-9-5-3-6-10-13)19-14-11-7-4-8-12-14/h3-12H,2H2,1H3
34 atoms
S  -1.287638 2.195075 -0.334912
S  0.201967 -0.451253 -1.491875
P  -1.019125 0.166268 0.09088
O  -2.47276 -0.399864 -0.240105
O  -0.485025 -0.141845 1.43871
C  0.303865 2.755509 0.237037
C  0.706437 -2.032879 -0.851084
C  -3.263645 -1.091117 0.75551
C  0.504538 2.972982 1.595657
C  0.064344 -3.186872 -1.285973
C  1.326499 2.984279 -0.676143
C  1.764875 -2.105872 0.047622
C  -2.833151 -2.52754 0.917798
C  1.743199 3.408207 2.041234
C  0.485187 -4.421641 -0.812775
C  2.561619 3.423529 -0.220797
C  2.176504 -3.344138 0.516429
C  2.771964 3.630641 1.135493
C  1.537428 -4.500785 0.088899
H  -3.224827 -0.55337 1.704066
H  -4.284838 -1.031734 0.382909
H  -0.299541 2.803699 2.299186
H  -0.756359 -3.122187 -1.98837
H  1.164552 2.817562 -1.732975
H  2.267154 -1.204509 0.373303
H  -1.812809 -2.609468 1.292661
H  -3.490336 -3.014117 1.640111
H  -2.906824 -3.075324 -0.021684
H  1.9035 3.570878 3.099009
H  -0.01291 -5.321866 -1.148388
H  3.361317 3.598204 -0.928542
H  2.999426 -3.404526 1.216593
H  3.738575 3.967112 1.487309
H  1.862819 -5.465159 0.456866
elementType: S P O C H
totalener: -1830.90571029 hartree
nucrepener: 1879.48321509 hartree
electener: -3710.38892538 hartree
oneelecener: -6254.81080794 hartree
twoeener: 2544.42188256 hartree
cpcmener: -0.02419351 hartree
kineticenergy: 1825.73282001 hartree
xcener: -123.391096904569 hartree
chargesum: -0.0000000
charge: -0.145646 -0.148917 0.711354 -0.360956 -0.599409 0.096049 0.118921 0.049635 -0.144994 -0.163662 -0.143488 -0.140824 -0.255486 -0.154014 -0.151728 -0.158300 -0.159794 -0.130651 -0.123635 0.099189 0.107191 0.140499 0.145578 0.142111 0.139500 0.081298 0.105406 0.088424 0.159012 0.158978 0.159259 0.159312 0.159761 0.160027
qa: -0.1456 -0.1489 0.7114 -0.3610 -0.5994 0.0960 0.1189 0.0496 -0.1450 -0.1637 -0.1435 -0.1408 -0.2555 -0.1540 -0.1517 -0.1583 -0.1598 -0.1307 -0.1236 0.0992 0.1072 0.1405 0.1456 0.1421 0.1395 0.0813 0.1054 0.0884 0.1590 0.1590 0.1593 0.1593 0.1598 0.1600
va: 2.3122 2.3007 5.3887 2.0968 1.9844 3.6860 3.6574 3.8518 3.9597 3.9113 3.9413 3.9495 3.9193 3.9170 3.9058 3.9284 3.9189 3.8896 3.8837 1.0033 0.9912 1.0090 1.0050 1.0060 1.0033 1.0131 1.0103 1.0011 0.9893 0.9892 0.9894 0.9891 0.9886 0.9883
dispcorr: -0.017486264 hartree
energy: -1830.923196550047
dipole: 1.15865 -0.99155 0.16710 -11.15874 10.36249 -0.79625 7.04554 -7.01686 0.02869
magnitude: 0.81410 au
magnitude: 2.06929 debye
