program: Orca
programVersion: 5.0.2
elementType: S S P O O C C C C C C C C C C C C C C H H H H H H H H H H H H H H H
charge: 0
multiplicity: 1
keywords: wb97x-d3
keywords: def2-TZVPP
keywords: def2/J RIJCOSX
keywords: DEFGRID2
keywords: scfconv7
keywords: smallprint printgap noloewdin
keywords: NOSOSCF
formula: C14H15O2PS2
InChI: InChI=1/C14H15O2PS2/c1-2-16-17(15,18-13-9-5-3-6-10-13)19-14-11-7-4-8-12-14/h3-12H,2H2,1H3
34 atoms
S  -1.106834 1.931596 -1.017826
S  0.438062 -0.90028 -1.43073
P  -0.723708 0.123912 -0.034866
O  -2.12674 -0.630186 -0.110315
O  -0.12225 0.272045 1.31161
C  0.26557 2.864476 -0.374423
C  0.692062 -2.380312 -0.472962
C  -2.983111 -0.72026 1.054918
C  1.497977 2.828053 -1.015456
C  1.703369 -2.42337 0.480171
C  0.077499 3.647752 0.757944
C  -0.109578 -3.491653 -0.708462
C  -2.66558 -1.951333 1.864569
C  2.55219 3.573871 -0.508036
C  1.912211 -3.590519 1.19951
C  1.133886 4.399063 1.250771
C  0.111358 -4.656507 0.01241
C  2.370963 4.359422 0.621962
C  1.119444 -4.706328 0.965563
H  -2.902384 0.185702 1.65877
H  -3.99634 -0.761478 0.658189
H  1.636852 2.222275 -1.90123
H  2.326917 -1.55655 0.654105
H  -0.885752 3.672614 1.249867
H  -0.896175 -3.450885 -1.45059
H  -1.653438 -1.923453 2.267709
H  -3.356928 -2.011862 2.7064
H  -2.781593 -2.859927 1.273344
H  3.515529 3.541205 -0.999542
H  2.698525 -3.627832 1.942104
H  0.989793 5.012737 2.130176
H  -0.507899 -5.524841 -0.170788
H  3.194564 4.943083 1.012273
H  1.289176 -5.616711 1.525633
elementType: S P O C H
totalener: -1830.90649398 hartree
nucrepener: 1868.33264842 hartree
electener: -3699.23914239 hartree
oneelecener: -6232.55962398 hartree
twoeener: 2533.32048159 hartree
cpcmener: -0.02497694 hartree
kineticenergy: 1825.73849000 hartree
xcener: -123.390371404171 hartree
chargesum: 0.0000000
charge: -0.149080 -0.142541 0.698064 -0.356869 -0.600734 0.079743 0.135331 0.047198 -0.118002 -0.159405 -0.130471 -0.167621 -0.258062 -0.173755 -0.151032 -0.164038 -0.149815 -0.121036 -0.131279 0.098956 0.107366 0.145457 0.143465 0.139745 0.141047 0.085609 0.105220 0.087662 0.158935 0.159687 0.159005 0.159592 0.161152 0.160505
qa: -0.1491 -0.1425 0.6981 -0.3569 -0.6007 0.0797 0.1353 0.0472 -0.1180 -0.1594 -0.1305 -0.1676 -0.2581 -0.1738 -0.1510 -0.1640 -0.1498 -0.1210 -0.1313 0.0990 0.1074 0.1455 0.1435 0.1397 0.1410 0.0856 0.1052 0.0877 0.1589 0.1597 0.1590 0.1596 0.1612 0.1605
va: 2.3056 2.3032 5.4083 2.0937 1.9861 3.7026 3.6577 3.8555 3.9305 3.9623 3.9593 3.9425 3.9193 3.9498 3.9127 3.9291 3.9044 3.8770 3.8894 1.0024 0.9926 1.0021 1.0061 1.0037 1.0097 1.0152 1.0111 1.0023 0.9902 0.9894 0.9894 0.9889 0.9879 0.9887
dispcorr: -0.017095506 hartree
energy: -1830.923589483550
dipole: -1.08226 0.87306 -0.20920 -7.26796 6.68588 -0.58208 11.31123 -10.93747 0.37375
magnitude: 0.72268 au
magnitude: 1.83691 debye
