program: Orca
programVersion: 5.0.2
elementType: S S P O O C C C C C C C C C C C C C C H H H H H H H H H H H H H H H
charge: 0
multiplicity: 1
keywords: wb97x-d3
keywords: def2-TZVPP
keywords: def2/J RIJCOSX
keywords: DEFGRID2
keywords: scfconv7
keywords: smallprint printgap noloewdin
keywords: NOSOSCF
formula: C14H15O2PS2
InChI: InChI=1/C14H15O2PS2/c1-2-16-17(15,18-13-9-5-3-6-10-13)19-14-11-7-4-8-12-14/h3-12H,2H2,1H3
34 atoms
S  -1.368114 1.786852 -0.189279
S  -0.516887 -1.256855 -1.507888
P  -1.566158 -0.293113 0.021441
O  -3.036993 -0.532723 -0.538158
O  -1.225601 -0.784772 1.377565
C  0.378366 1.938089 0.113282
C  0.968929 -1.696567 -0.632618
C  -4.224025 0.12859 -0.041505
C  1.187845 2.38088 -0.926952
C  0.960626 -2.737008 0.29036
C  0.91887 1.678311 1.368756
C  2.148204 -1.024287 -0.929101
C  -4.411792 0.010873 1.451258
C  2.546625 2.5601 -0.709029
C  2.136375 -3.078953 0.941283
C  2.281639 1.836111 1.568052
C  3.321223 -1.378289 -0.27813
C  3.095947 2.279549 0.533803
C  3.314383 -2.397872 0.663162
H  -4.208623 1.174541 -0.357412
H  -5.041973 -0.357528 -0.569972
H  0.762857 2.580124 -1.902191
H  0.04715 -3.276875 0.499784
H  0.285844 1.356911 2.184112
H  2.150836 -0.22386 -1.65625
H  -3.678932 0.586625 2.015981
H  -5.397251 0.404595 1.702973
H  -4.374563 -1.026988 1.781429
H  3.176034 2.907449 -1.517988
H  2.130937 -3.881592 1.667246
H  2.706288 1.619364 2.539553
H  4.237845 -0.848584 -0.502576
H  4.157726 2.408975 0.698724
H  4.228755 -2.667533 1.175614
elementType: S P O C H
totalener: -1830.90231673 hartree
nucrepener: 1923.90374551 hartree
electener: -3754.80606224 hartree
oneelecener: -6343.57285248 hartree
twoeener: 2588.76679025 hartree
cpcmener: -0.02449793 hartree
kineticenergy: 1825.73012133 hartree
xcener: -123.395121738652 hartree
chargesum: 0.0000000
charge: -0.149546 -0.130362 0.713068 -0.352778 -0.589176 0.083722 0.053268 0.009168 -0.140409 -0.125631 -0.122652 -0.109114 -0.235629 -0.150096 -0.166151 -0.155116 -0.194345 -0.144490 -0.112044 0.103355 0.112095 0.138759 0.140013 0.140632 0.156524 0.082181 0.098523 0.096745 0.157417 0.158478 0.158165 0.156477 0.158370 0.160577
qa: -0.1495 -0.1304 0.7131 -0.3528 -0.5892 0.0837 0.0533 0.0092 -0.1404 -0.1256 -0.1227 -0.1091 -0.2356 -0.1501 -0.1662 -0.1551 -0.1943 -0.1445 -0.1120 0.1034 0.1121 0.1388 0.1400 0.1406 0.1565 0.0822 0.0985 0.0967 0.1574 0.1585 0.1582 0.1565 0.1584 0.1606
va: 2.3060 2.3253 5.3707 2.1319 1.9940 3.6836 3.7305 3.8821 3.8987 3.9143 3.8731 3.8331 3.9024 3.8814 3.9273 3.8685 3.9276 3.8467 3.8755 0.9883 0.9877 1.0124 1.0079 1.0147 0.9966 1.0149 1.0089 1.0059 0.9894 0.9895 0.9904 0.9937 0.9898 0.9874
dispcorr: -0.019532158 hartree
energy: -1830.921848884062
dipole: 2.51376 -1.90621 0.60754 1.20734 -0.46157 0.74576 6.96187 -7.24668 -0.28480
magnitude: 1.00319 au
magnitude: 2.54990 debye
