program: Orca
programVersion: 5.0.2
elementType: S S P O O C C C C C C C C C C C C C C H H H H H H H H H H H H H H H
charge: 0
multiplicity: 1
keywords: wb97x-d3
keywords: def2-TZVPP
keywords: def2/J RIJCOSX
keywords: DEFGRID2
keywords: scfconv7
keywords: smallprint printgap noloewdin
keywords: NOSOSCF
formula: C14H15O2PS2
InChI: InChI=1/C14H15O2PS2/c1-2-16-17(15,18-13-9-5-3-6-10-13)19-14-11-7-4-8-12-14/h3-12H,2H2,1H3
34 atoms
S  -0.691412 1.592881 -1.091229
S  -1.127316 -1.791352 -0.742956
P  -1.602203 0.095513 0.051236
O  -3.091913 0.301331 -0.468633
O  -1.328327 0.208726 1.50334
C  0.751018 1.906169 -0.096554
C  0.621095 -1.808839 -0.413264
C  -4.177327 -0.629204 -0.247101
C  1.99464 1.513203 -0.575783
C  1.490667 -1.844257 -1.49746
C  0.641084 2.582056 1.113918
C  1.111075 -1.84643 0.888207
C  -4.372436 -1.014091 1.199013
C  3.132628 1.77789 0.172503
C  2.858732 -1.915166 -1.275755
C  1.783104 2.834126 1.859178
C  2.480792 -1.890518 1.098236
C  3.027236 2.429583 1.393143
C  3.355277 -1.92892 0.019727
H  -5.055531 -0.110633 -0.627359
H  -4.022999 -1.510537 -0.874252
H  2.075069 0.997056 -1.522577
H  1.104212 -1.812758 -2.507891
H  -0.324296 2.911497 1.472828
H  0.434114 -1.841895 1.731031
H  -4.477073 -0.137809 1.838456
H  -5.293356 -1.593288 1.275636
H  -3.564947 -1.636788 1.58397
H  4.100194 1.4665 -0.198894
H  3.535485 -1.946942 -2.1197
H  1.699408 3.352571 2.805429
H  2.864195 -1.905897 2.110036
H  3.915239 2.628545 1.979003
H  4.423108 -1.97275 0.190238
elementType: S P O C H
totalener: -1830.90228452 hartree
nucrepener: 1925.49743184 hartree
electener: -3756.39971636 hartree
oneelecener: -6346.77030198 hartree
twoeener: 2590.37058562 hartree
cpcmener: -0.02442647 hartree
kineticenergy: 1825.72657900 hartree
xcener: -123.394779267844 hartree
chargesum: -0.0000000
charge: -0.130462 -0.149178 0.714846 -0.352453 -0.588713 0.047741 0.086713 0.007646 -0.101185 -0.143280 -0.121235 -0.128386 -0.234816 -0.195897 -0.145997 -0.166945 -0.151660 -0.111214 -0.146966 0.113285 0.103518 0.152564 0.138834 0.138157 0.141218 0.097019 0.098668 0.081637 0.155179 0.156803 0.158618 0.157603 0.159948 0.158389
qa: -0.1305 -0.1492 0.7148 -0.3525 -0.5887 0.0477 0.0867 0.0076 -0.1012 -0.1433 -0.1212 -0.1284 -0.2348 -0.1959 -0.1460 -0.1669 -0.1517 -0.1112 -0.1470 0.1133 0.1035 0.1526 0.1388 0.1382 0.1412 0.0970 0.0987 0.0816 0.1552 0.1568 0.1586 0.1576 0.1599 0.1584
va: 2.3256 2.3067 5.3685 2.1326 1.9946 3.7300 3.6833 3.8812 3.8314 3.8977 3.9126 3.8756 3.9025 3.9262 3.8799 3.9300 3.8670 3.8725 3.8488 0.9875 0.9881 0.9985 1.0123 1.0096 1.0150 1.0058 1.0090 1.0152 0.9942 0.9895 0.9894 0.9906 0.9877 0.9900
dispcorr: -0.019637733 hartree
energy: -1830.921922257571
dipole: 2.77387 -2.07057 0.70330 -3.14554 2.56008 -0.58546 6.28409 -6.76567 -0.48158
magnitude: 1.03408 au
magnitude: 2.62841 debye
