program: Orca
programVersion: 5.0.2
elementType: S S P O O C C C C C C C C C C C C C C H H H H H H H H H H H H H H H
charge: 0
multiplicity: 1
keywords: wb97x-d3
keywords: def2-TZVPP
keywords: def2/J RIJCOSX
keywords: DEFGRID2
keywords: scfconv7
keywords: smallprint printgap noloewdin
keywords: NOSOSCF
formula: C14H15O2PS2
InChI: InChI=1/C14H15O2PS2/c1-2-16-17(15,18-13-9-5-3-6-10-13)19-14-11-7-4-8-12-14/h3-12H,2H2,1H3
34 atoms
S  0.167093 1.08377 -1.279217
S  -0.200565 -0.906788 1.465117
P  -1.215349 0.267691 0.05875
O  -1.930331 -0.734392 -0.953114
O  -2.052554 1.250014 0.786073
C  0.802086 2.366776 -0.22181
C  0.484711 -2.161637 0.407348
C  -3.37134 -0.882011 -0.977073
C  1.953837 2.150368 0.525421
C  -0.237748 -3.327509 0.177907
C  0.162839 3.601877 -0.192851
C  1.747676 -1.994397 -0.148608
C  -3.900125 -1.652481 0.206579
C  2.463459 3.175816 1.309159
C  0.304262 -4.323433 -0.620288
C  0.683362 4.623243 0.587492
C  2.281088 -2.994021 -0.949732
C  1.830836 4.410719 1.340122
C  1.56033 -4.155791 -1.188274
H  -3.835577 0.102902 -1.046622
H  -3.573352 -1.411046 -1.906635
H  2.454278 1.191992 0.495096
H  -1.215672 -3.45834 0.62225
H  -0.729664 3.767682 -0.781509
H  2.312843 -1.092221 0.041307
H  -4.973219 -1.799092 0.075574
H  -3.438096 -2.636237 0.287549
H  -3.755559 -1.118117 1.145716
H  3.35821 3.007701 1.894125
H  -0.258049 -5.230426 -0.799774
H  0.189794 5.586038 0.607128
H  3.262157 -2.862323 -1.387234
H  2.233773 5.209851 1.948841
H  1.979005 -4.933421 -1.814019
elementType: S P O C H
totalener: -1830.90526871 hartree
nucrepener: 1885.14229798 hartree
electener: -3716.04756669 hartree
oneelecener: -6265.74239200 hartree
twoeener: 2549.69482531 hartree
cpcmener: -0.02682895 hartree
kineticenergy: 1825.73370789 hartree
xcener: -123.392833988053 hartree
chargesum: -0.0000000
charge: -0.146262 -0.136645 0.694491 -0.352058 -0.611552 0.038065 -0.002063 0.043976 -0.095371 -0.088132 -0.107225 -0.063855 -0.263810 -0.199309 -0.213864 -0.179080 -0.221098 -0.103478 -0.084996 0.104113 0.107957 0.170146 0.160294 0.140011 0.175261 0.104225 0.090589 0.089729 0.156440 0.157342 0.158490 0.155718 0.160883 0.161067
qa: -0.1463 -0.1366 0.6945 -0.3521 -0.6116 0.0381 -0.0021 0.0440 -0.0954 -0.0881 -0.1072 -0.0639 -0.2638 -0.1993 -0.2139 -0.1791 -0.2211 -0.1035 -0.0850 0.1041 0.1080 0.1701 0.1603 0.1400 0.1753 0.1042 0.0906 0.0897 0.1564 0.1573 0.1585 0.1557 0.1609 0.1611
va: 2.2998 2.3063 5.3896 2.0917 1.9970 3.7330 3.7444 3.8366 3.8388 3.8718 3.9380 3.7990 3.9200 3.9736 3.9716 3.9353 3.9903 3.8604 3.8489 1.0040 0.9915 0.9756 0.9820 1.0045 0.9642 1.0111 1.0010 1.0150 0.9943 0.9921 0.9897 0.9949 0.9880 0.9872
dispcorr: -0.017827207 hartree
energy: -1830.923095916900
dipole: -3.43757 4.06950 0.63193 -5.66816 4.51651 -1.15166 -0.96031 0.18717 -0.77314
magnitude: 1.52427 au
magnitude: 3.87438 debye
