program: Orca
programVersion: 5.0.2
elementType: S S P O O C C C C C C C C C C C C C C H H H H H H H H H H H H H H H
charge: 0
multiplicity: 1
keywords: wb97x-d3
keywords: def2-TZVPP
keywords: def2/J RIJCOSX
keywords: DEFGRID2
keywords: scfconv7
keywords: smallprint printgap noloewdin
keywords: NOSOSCF
formula: C14H15O2PS2
InChI: InChI=1/C14H15O2PS2/c1-2-16-17(15,18-13-9-5-3-6-10-13)19-14-11-7-4-8-12-14/h3-12H,2H2,1H3
34 atoms
S  -0.380138 0.816702 1.421517
S  0.281278 -1.047218 -1.346122
P  -1.207278 -0.496343 0.014431
O  -2.0991 0.381653 -0.971217
O  -1.856411 -1.61859 0.732579
C  0.157247 2.144373 0.364634
C  1.12611 -2.227593 -0.315092
C  -3.545214 0.383235 -0.894971
C  1.461984 2.166255 -0.114618
C  2.221897 -1.839002 0.447228
C  -0.716931 3.184237 0.065007
C  0.705948 -3.553885 -0.32135
C  -4.075461 1.023252 0.36369
C  1.8852 3.221329 -0.909917
C  2.893683 -2.782443 1.211155
C  -0.286318 4.236297 -0.729537
C  1.388388 -4.49171 0.438411
C  1.011843 4.253778 -1.221639
C  2.478878 -4.106999 1.207311
H  -3.859401 0.941759 -1.774664
H  -3.909723 -0.639411 -1.001265
H  2.148704 1.369033 0.131809
H  2.555947 -0.810693 0.445343
H  -1.726562 3.177882 0.453064
H  -0.14253 -3.854282 -0.92184
H  -3.712143 2.043319 0.485225
H  -5.163554 1.065129 0.297407
H  -3.825121 0.452602 1.258133
H  2.900274 3.233664 -1.284935
H  3.744271 -2.479078 1.807661
H  -0.968119 5.0434 -0.963708
H  1.066193 -5.524894 0.428696
H  1.344113 5.074828 -1.843646
H  3.007962 -4.841089 1.801065
elementType: S P O C H
totalener: -1830.90505195 hartree
nucrepener: 1887.37320639 hartree
electener: -3718.27825834 hartree
oneelecener: -6270.19138988 hartree
twoeener: 2551.91313154 hartree
cpcmener: -0.02725301 hartree
kineticenergy: 1825.72727430 hartree
xcener: -123.392463448647 hartree
chargesum: 0.0000000
charge: -0.138347 -0.144919 0.694354 -0.350065 -0.612665 -0.024071 0.025074 0.040529 -0.059414 -0.082698 -0.070568 -0.098332 -0.268139 -0.228033 -0.213871 -0.225077 -0.185226 -0.079142 -0.096017 0.108955 0.107019 0.180594 0.174200 0.168721 0.139322 0.093380 0.104861 0.090462 0.155482 0.156069 0.157140 0.158660 0.161137 0.160624
qa: -0.1383 -0.1449 0.6944 -0.3501 -0.6127 -0.0241 0.0251 0.0405 -0.0594 -0.0827 -0.0706 -0.0983 -0.2681 -0.2280 -0.2139 -0.2251 -0.1852 -0.0791 -0.0960 0.1090 0.1070 0.1806 0.1742 0.1687 0.1393 0.0934 0.1049 0.0905 0.1555 0.1561 0.1571 0.1587 0.1611 0.1606
va: 2.3059 2.3011 5.3903 2.0921 1.9967 3.7657 3.7377 3.8348 3.7888 3.8192 3.8454 3.9298 3.9170 3.9938 3.9875 3.9809 3.9406 3.8436 3.8549 0.9909 1.0027 0.9627 0.9723 0.9719 1.0043 1.0002 1.0112 1.0148 0.9951 0.9948 0.9930 0.9897 0.9873 0.9879
dispcorr: -0.017940139 hartree
energy: -1830.922992088845
dipole: -3.84629 4.31447 0.46818 5.22267 -3.92320 1.29947 -0.38009 -0.32510 -0.70519
magnitude: 1.55084 au
magnitude: 3.94192 debye
