program: Orca
programVersion: 5.0.2
elementType: S S P O O C C C C C C C C C C C C C C H H H H H H H H H H H H H H H
charge: 0
multiplicity: 1
keywords: wb97x-d3
keywords: def2-TZVPP
keywords: def2/J RIJCOSX
keywords: DEFGRID2
keywords: scfconv7
keywords: smallprint printgap noloewdin
keywords: NOSOSCF
formula: C14H15O2PS2
InChI: InChI=1/C14H15O2PS2/c1-2-16-17(15,18-13-9-5-3-6-10-13)19-14-11-7-4-8-12-14/h3-12H,2H2,1H3
34 atoms
S  0.144077 0.868207 -1.052935
S  -1.04816 -2.093986 -0.401659
P  -0.699824 -0.241751 0.510472
O  -2.160887 0.331674 0.772839
O  0.108406 -0.265129 1.749174
C  0.370711 2.399176 -0.172046
C  0.613617 -2.730397 -0.342777
C  -3.174935 0.483416 -0.24027
C  -0.575909 3.408747 -0.308999
C  1.062404 -3.374575 0.804628
C  1.500049 2.588147 0.616021
C  1.427179 -2.628496 -1.465132
C  -4.164949 1.516489 0.229637
C  -0.390358 4.612913 0.353767
C  2.338371 -3.918199 0.824105
C  1.674304 3.794065 1.277825
C  2.702919 -3.173024 -1.434317
C  0.731589 4.805167 1.147857
C  3.158195 -3.817335 -0.292343
H  -2.720006 0.786077 -1.186355
H  -3.663916 -0.481286 -0.392028
H  -1.448894 3.258871 -0.931019
H  0.42077 -3.459406 1.671688
H  2.238205 1.802988 0.710297
H  1.069078 -2.131955 -2.357404
H  -3.689373 2.485448 0.384192
H  -4.937966 1.638413 -0.529553
H  -4.652012 1.214386 1.157656
H  -1.12478 5.400651 0.248456
H  2.691008 -4.423505 1.713562
H  2.549531 3.942758 1.896095
H  3.339143 -3.094033 -2.305962
H  0.872237 5.744923 1.665557
H  4.152671 -4.244513 -0.2730
elementType: S P O C H
totalener: -1830.90628243 hartree
nucrepener: 1861.83726981 hartree
electener: -3692.74355224 hartree
oneelecener: -6219.17467030 hartree
twoeener: 2526.43111806 hartree
cpcmener: -0.02871217 hartree
kineticenergy: 1825.72704113 hartree
xcener: -123.390602536258 hartree
chargesum: 0.0000000
charge: -0.169328 -0.169482 0.691872 -0.336452 -0.594822 0.116573 0.104800 -0.002321 -0.138675 -0.142779 -0.146309 -0.127568 -0.240893 -0.167818 -0.154569 -0.154346 -0.163436 -0.127496 -0.127256 0.114845 0.123302 0.152385 0.143426 0.142505 0.144158 0.085594 0.091008 0.094277 0.158857 0.159640 0.159502 0.159592 0.160425 0.160788
qa: -0.1693 -0.1695 0.6919 -0.3365 -0.5948 0.1166 0.1048 -0.0023 -0.1387 -0.1428 -0.1463 -0.1276 -0.2409 -0.1678 -0.1546 -0.1543 -0.1634 -0.1275 -0.1273 0.1148 0.1233 0.1524 0.1434 0.1425 0.1442 0.0856 0.0910 0.0943 0.1589 0.1596 0.1595 0.1596 0.1604 0.1608
va: 2.2810 2.2871 5.4336 2.1006 2.0222 3.7146 3.6989 3.8220 3.9275 3.9716 3.9638 3.9286 3.9625 3.9319 3.9196 3.9161 3.9365 3.8892 3.8869 0.9965 0.9909 0.9912 1.0046 1.0051 1.0035 1.0069 1.0050 1.0038 0.9908 0.9892 0.9892 0.9897 0.9884 0.9883
dispcorr: -0.016493482 hartree
energy: -1830.922775910034
dipole: -3.93405 3.50769 -0.42636 7.72890 -7.10282 0.62608 0.03003 -1.43336 -1.40332
magnitude: 1.59470 au
magnitude: 4.05341 debye
