program: Orca
programVersion: 5.0.2
elementType: S S P O O C C C C C C C C C C C C C C H H H H H H H H H H H H H H H
charge: 0
multiplicity: 1
keywords: wb97x-d3
keywords: def2-TZVPP
keywords: def2/J RIJCOSX
keywords: DEFGRID2
keywords: scfconv7
keywords: smallprint printgap noloewdin
keywords: NOSOSCF
formula: C14H15O2PS2
InChI: InChI=1/C14H15O2PS2/c1-2-16-17(15,18-13-9-5-3-6-10-13)19-14-11-7-4-8-12-14/h3-12H,2H2,1H3
34 atoms
S  -1.222341 2.049888 -0.02927
S  -0.691512 -1.078629 -1.330873
P  -1.596048 0.010328 0.216865
O  -3.112118 0.045229 -0.267362
O  -1.285952 -0.527329 1.562606
C  0.547129 2.022593 0.16813
C  0.84871 -1.57274 -0.591313
C  -3.993147 -1.086048 -0.056861
C  1.338398 2.397135 -0.911821
C  2.026632 -1.055712 -1.118036
C  1.126879 1.691415 1.388945
C  0.884992 -2.512476 0.433575
C  -4.704604 -0.988098 1.268646
C  2.717755 2.44102 -0.767225
C  3.246995 -1.465201 -0.601053
C  2.507419 1.71246 1.514296
C  2.109883 -2.904798 0.952724
C  3.303171 2.090792 0.441081
C  3.289663 -2.382242 0.439488
H  -4.697893 -1.051599 -0.88597
H  -3.433909 -2.021289 -0.13982
H  0.881828 2.651782 -1.859506
H  1.992293 -0.336505 -1.92517
H  0.511154 1.423547 2.236328
H  -0.029886 -2.937532 0.822544
H  -5.259346 -0.05364 1.355039
H  -5.418727 -1.808561 1.348886
H  -4.013625 -1.063447 2.107587
H  3.333711 2.739816 -1.605343
H  4.163074 -1.060232 -1.010697
H  2.960511 1.44336 2.459401
H  2.141195 -3.626714 1.758459
H  4.379658 2.116573 0.549173
H  4.242377 -2.693349 0.847884
elementType: S P O C H
totalener: -1830.90522986 hartree
nucrepener: 1919.75251355 hartree
electener: -3750.65774341 hartree
oneelecener: -6335.15180914 hartree
twoeener: 2584.49406572 hartree
cpcmener: -0.02322033 hartree
kineticenergy: 1825.73470176 hartree
xcener: -123.393866723088 hartree
chargesum: 0.0000000
charge: -0.116257 -0.146788 0.717392 -0.363227 -0.590799 0.056219 0.067053 0.048246 -0.136457 -0.103133 -0.124639 -0.120651 -0.243599 -0.146022 -0.194699 -0.153150 -0.168315 -0.145031 -0.113562 0.109913 0.089481 0.139084 0.146758 0.141240 0.138614 0.088945 0.094838 0.082343 0.157320 0.154317 0.157972 0.158770 0.158793 0.159031
qa: -0.1163 -0.1468 0.7174 -0.3632 -0.5908 0.0562 0.0671 0.0482 -0.1365 -0.1031 -0.1246 -0.1207 -0.2436 -0.1460 -0.1947 -0.1531 -0.1683 -0.1450 -0.1136 0.1099 0.0895 0.1391 0.1468 0.1412 0.1386 0.0889 0.0948 0.0823 0.1573 0.1543 0.1580 0.1588 0.1588 0.1590
va: 2.3308 2.3171 5.3783 2.1124 1.9979 3.6909 3.7167 3.8615 3.8880 3.8455 3.8707 3.9117 3.9356 3.8772 3.9287 3.8688 3.9302 3.8458 3.8697 0.9899 1.0035 1.0106 1.0019 1.0167 1.0093 1.0042 1.0069 1.0199 0.9895 0.9944 0.9904 0.9895 0.9897 0.9881
dispcorr: -0.019609334 hartree
energy: -1830.924839192721
dipole: 2.90059 -1.99290 0.90769 -5.85181 5.41133 -0.44048 4.67205 -5.30396 -0.63190
magnitude: 1.19047 au
magnitude: 3.02594 debye
