program: Orca
programVersion: 5.0.2
elementType: S S P O O C C C C C C C C C C C C C C H H H H H H H H H H H H H H H
charge: 0
multiplicity: 1
keywords: wb97x-d3
keywords: def2-TZVPP
keywords: def2/J RIJCOSX
keywords: DEFGRID2
keywords: scfconv7
keywords: smallprint printgap noloewdin
keywords: NOSOSCF
formula: C14H15O2PS2
InChI: InChI=1/C14H15O2PS2/c1-2-16-17(15,18-13-9-5-3-6-10-13)19-14-11-7-4-8-12-14/h3-12H,2H2,1H3
34 atoms
S  -1.196605 1.984106 -0.11368
S  -0.713742 -1.215219 -1.288889
P  -1.623812 -0.038043 0.188003
O  -3.12122 0.009371 -0.350551
O  -1.377419 -0.534683 1.562713
C  0.566367 1.955851 0.135699
C  0.862624 -1.589169 -0.5535
C  -4.075354 -1.022159 0.004679
C  1.384594 2.350541 -0.916703
C  2.005936 -1.090348 -1.167536
C  1.114775 1.616354 1.368688
C  0.961866 -2.419209 0.557927
C  -4.812493 -0.668389 1.27095
C  2.758885 2.404619 -0.733144
C  3.254589 -1.411274 -0.656142
C  2.491207 1.645994 1.531964
C  2.214744 -2.719657 1.071761
C  3.313631 2.044282 0.486512
C  3.359977 -2.217386 0.468468
H  -4.75485 -1.080912 -0.843896
H  -3.574649 -1.98913 0.092632
H  0.952892 2.612583 -1.874006
H  1.921972 -0.453183 -2.037675
H  0.479117 1.33498 2.19671
H  0.074648 -2.831002 1.018265
H  -4.145227 -0.630982 2.131615
H  -5.320571 0.29197 1.180279
H  -5.568784 -1.429171 1.467656
H  3.395101 2.719257 -1.550057
H  4.143506 -1.021819 -1.134904
H  2.919922 1.369512 2.486283
H  2.294752 -3.356406 1.943138
H  4.386418 2.077259 0.625102
H  4.334779 -2.459151 0.871628
elementType: S P O C H
totalener: -1830.90490241 hartree
nucrepener: 1921.31715319 hartree
electener: -3752.22205561 hartree
oneelecener: -6338.27372859 hartree
twoeener: 2586.05167298 hartree
cpcmener: -0.02281780 hartree
kineticenergy: 1825.73365753 hartree
xcener: -123.393864544013 hartree
chargesum: 0.0000000
charge: -0.114683 -0.142740 0.716467 -0.366627 -0.589868 0.059600 0.056351 0.046046 -0.137443 -0.092750 -0.128259 -0.112712 -0.243197 -0.143811 -0.203154 -0.157935 -0.170893 -0.142211 -0.110799 0.109007 0.093324 0.138675 0.145085 0.142935 0.137108 0.082185 0.088688 0.094945 0.157124 0.155301 0.157751 0.158752 0.158793 0.158947
qa: -0.1147 -0.1427 0.7165 -0.3666 -0.5899 0.0596 0.0564 0.0460 -0.1374 -0.0927 -0.1283 -0.1127 -0.2432 -0.1438 -0.2032 -0.1579 -0.1709 -0.1422 -0.1108 0.1090 0.0933 0.1387 0.1451 0.1429 0.1371 0.0822 0.0887 0.0949 0.1571 0.1553 0.1578 0.1588 0.1588 0.1589
va: 2.3372 2.3240 5.3762 2.1087 1.9976 3.6951 3.7144 3.8622 3.8867 3.8332 3.8529 3.9027 3.9355 3.8842 3.9229 3.8631 3.9331 3.8434 3.8542 0.9905 1.0019 1.0108 1.0034 1.0167 1.0128 1.0202 1.0040 1.0073 0.9896 0.9940 0.9909 0.9897 0.9897 0.9884
dispcorr: -0.019834476 hartree
energy: -1830.924736890469
dipole: 2.75549 -1.81368 0.94181 -4.40411 4.07172 -0.33239 5.15264 -5.69571 -0.54307
magnitude: 1.13684 au
magnitude: 2.88962 debye
