program: Orca
programVersion: 5.0.2
elementType: S S P O O C C C C C C C C C C C C C C H H H H H H H H H H H H H H H
charge: 0
multiplicity: 1
keywords: wb97x-d3
keywords: def2-TZVPP
keywords: def2/J RIJCOSX
keywords: DEFGRID2
keywords: scfconv7
keywords: smallprint printgap noloewdin
keywords: NOSOSCF
formula: C14H15O2PS2
InChI: InChI=1/C14H15O2PS2/c1-2-16-17(15,18-13-9-5-3-6-10-13)19-14-11-7-4-8-12-14/h3-12H,2H2,1H3
34 atoms
S  -1.356852 1.995582 0.152334
S  0.141645 -0.54644 -1.254748
P  -0.852723 -0.003074 0.506169
O  -2.269192 -0.729303 0.525064
O  -0.078208 -0.284621 1.734236
C  0.262646 2.704952 0.359197
C  0.770567 -2.114565 -0.693252
C  -3.236032 -0.662418 -0.541406
C  0.751168 2.945977 1.638382
C  0.01156 -3.265638 -0.869561
C  1.004446 3.054441 -0.762839
C  2.027489 -2.176011 -0.10275
C  -4.173014 -1.833391 -0.404328
C  1.997835 3.534166 1.790042
C  0.517994 -4.487031 -0.449039
C  2.248453 3.646746 -0.600033
C  2.526717 -3.402084 0.310798
C  2.74628 3.883794 0.673851
C  1.773149 -4.555883 0.14033
H  -3.781144 0.280964 -0.46361
H  -2.729525 -0.684682 -1.509453
H  0.163398 2.682883 2.507622
H  -0.964639 -3.211202 -1.333819
H  0.616127 2.86731 -1.755367
H  2.611723 -1.275333 0.032122
H  -4.693961 -1.821246 0.553074
H  -4.923336 -1.781654 -1.19364
H  -3.645395 -2.782156 -0.504677
H  2.383442 3.720283 2.783883
H  -0.070733 -5.385179 -0.58218
H  2.828884 3.919728 -1.471548
H  3.504795 -3.453758 0.770944
H  3.717938 4.344181 0.797411
H  2.165314 -5.51029 0.466902
elementType: S P O C H
totalener: -1830.90666654 hartree
nucrepener: 1865.47743872 hartree
electener: -3696.38410526 hartree
oneelecener: -6226.53896828 hartree
twoeener: 2530.15486302 hartree
cpcmener: -0.02869949 hartree
kineticenergy: 1825.73335447 hartree
xcener: -123.391989588774 hartree
chargesum: -0.0000000
charge: -0.165459 -0.170267 0.691271 -0.336034 -0.595498 0.103435 0.098338 0.006793 -0.139125 -0.112490 -0.135936 -0.134438 -0.240084 -0.157326 -0.180929 -0.157195 -0.161110 -0.129270 -0.117614 0.117441 0.112445 0.143329 0.149848 0.143536 0.140258 0.092479 0.089983 0.085783 0.159982 0.158364 0.159612 0.159175 0.160849 0.159854
qa: -0.1655 -0.1703 0.6913 -0.3360 -0.5955 0.1034 0.0983 0.0068 -0.1391 -0.1125 -0.1359 -0.1344 -0.2401 -0.1573 -0.1809 -0.1572 -0.1611 -0.1293 -0.1176 0.1174 0.1124 0.1433 0.1498 0.1435 0.1403 0.0925 0.0900 0.0858 0.1600 0.1584 0.1596 0.1592 0.1608 0.1599
va: 2.2967 2.2784 5.4341 2.1082 2.0191 3.6927 3.7122 3.8320 3.9588 3.9149 3.9268 3.9488 3.9691 3.9203 3.9408 3.9283 3.9238 3.8874 3.8758 0.9891 0.9958 1.0071 0.9912 1.0056 1.0025 1.0038 1.0057 1.0067 0.9893 0.9907 0.9894 0.9891 0.9883 0.9882
dispcorr: -0.016338779 hartree
energy: -1830.923005322498
dipole: -2.09605 1.94488 -0.15116 -7.18803 7.02805 -0.15998 -2.14235 0.61915 -1.52320
magnitude: 1.53902 au
magnitude: 3.91188 debye
