program: Orca
programVersion: 5.0.2
elementType: S S P O O C C C C C C C C C C C C C C H H H H H H H H H H H H H H H
charge: 0
multiplicity: 1
keywords: wb97x-d3
keywords: def2-TZVPP
keywords: def2/J RIJCOSX
keywords: DEFGRID2
keywords: scfconv7
keywords: smallprint printgap noloewdin
keywords: NOSOSCF
formula: C14H15O2PS2
InChI: InChI=1/C14H15O2PS2/c1-2-16-17(15,18-13-9-5-3-6-10-13)19-14-11-7-4-8-12-14/h3-12H,2H2,1H3
34 atoms
S  -0.581766 1.461464 -1.179159
S  0.263057 -0.756559 1.272409
P  -1.321244 0.296594 0.392383
O  -2.184074 -0.704998 -0.493062
O  -2.00407 1.046118 1.473524
C  0.489227 2.505855 -0.216903
C  0.623295 -2.035044 0.089235
C  -3.397146 -1.317399 0.009037
C  -0.043732 3.582065 0.484079
C  1.203173 -1.751898 -1.142496
C  1.858466 2.263794 -0.209783
C  0.384382 -3.352743 0.466379
C  -3.12819 -2.412006 1.010785
C  0.802121 4.413738 1.20269
C  1.509129 -2.790779 -2.009568
C  2.697218 3.104286 0.507594
C  0.713813 -4.386322 -0.398683
C  2.170248 4.176372 1.214763
C  1.266962 -4.107199 -1.64065
H  -4.04307 -0.545263 0.429441
H  -3.885967 -1.715239 -0.878241
H  -1.108375 3.773242 0.464188
H  1.416548 -0.731378 -1.42974
H  2.268953 1.426459 -0.75904
H  -0.052515 -3.572297 1.432004
H  -2.687175 -2.031427 1.932519
H  -4.076237 -2.883491 1.273488
H  -2.47731 -3.182667 0.598821
H  0.390291 5.250998 1.750824
H  1.948385 -2.568661 -2.973595
H  3.763395 2.918419 0.514005
H  0.531916 -5.410516 -0.099863
H  2.826963 4.830045 1.77424
H  1.51498 -4.914455 -2.317625
elementType: S P O C H
totalener: -1830.90435795 hartree
nucrepener: 1888.70185410 hartree
electener: -3719.60621205 hartree
oneelecener: -6272.70591087 hartree
twoeener: 2553.09969882 hartree
cpcmener: -0.02575227 hartree
kineticenergy: 1825.72542910 hartree
xcener: -123.392463805818 hartree
chargesum: 0.0000000
charge: -0.137809 -0.131557 0.700066 -0.345758 -0.608574 0.040170 0.036771 0.048066 -0.106799 -0.072273 -0.118119 -0.116001 -0.272713 -0.173829 -0.210205 -0.171956 -0.183533 -0.118057 -0.106633 0.103030 0.106112 0.141481 0.133042 0.162589 0.152595 0.092432 0.107806 0.093357 0.159232 0.158208 0.159318 0.158942 0.159867 0.160733
qa: -0.1378 -0.1316 0.7001 -0.3458 -0.6086 0.0402 0.0368 0.0481 -0.1068 -0.0723 -0.1181 -0.1160 -0.2727 -0.1738 -0.2102 -0.1720 -0.1835 -0.1181 -0.1066 0.1030 0.1061 0.1415 0.1330 0.1626 0.1526 0.0924 0.1078 0.0934 0.1592 0.1582 0.1593 0.1589 0.1599 0.1607
va: 2.3031 2.3145 5.3889 2.1038 2.0037 3.7581 3.6933 3.8364 3.9304 3.8338 3.8663 3.8637 3.9180 3.9364 3.9985 3.9406 3.9508 3.8772 3.8675 1.0047 0.9899 1.0078 1.0043 0.9824 0.9964 1.0123 1.0120 0.9981 0.9897 0.9921 0.9907 0.9901 0.9882 0.9877
dispcorr: -0.018087340 hartree
energy: -1830.922445291161
dipole: -0.79000 1.50033 0.71033 -9.16417 7.77688 -1.38729 0.20984 -1.10292 -0.89308
magnitude: 1.79631 au
magnitude: 4.56586 debye
