program: Orca
programVersion: 5.0.2
elementType: S S P O O C C C C C C C C C C C C C C H H H H H H H H H H H H H H H
charge: 0
multiplicity: 1
keywords: wb97x-d3
keywords: def2-TZVPP
keywords: def2/J RIJCOSX
keywords: DEFGRID2
keywords: scfconv7
keywords: smallprint printgap noloewdin
keywords: NOSOSCF
formula: C14H15O2PS2
InChI: InChI=1/C14H15O2PS2/c1-2-16-17(15,18-13-9-5-3-6-10-13)19-14-11-7-4-8-12-14/h3-12H,2H2,1H3
34 atoms
S  -0.572367 1.383586 -1.159074
S  -1.246733 -1.846447 -0.528974
P  -1.524442 0.103026 0.204161
O  -3.064122 0.313933 -0.184478
O  -1.146927 0.308029 1.615834
C  0.723766 2.013317 -0.120188
C  0.52154 -1.929515 -0.385424
C  -4.09433 0.184206 0.808397
C  0.481783 3.112446 0.693378
C  1.1375 -1.944846 0.861157
C  1.990672 1.449346 -0.18512
C  1.282411 -2.015994 -1.546296
C  -4.403311 -1.261532 1.126627
C  1.515233 3.648718 1.44425
C  2.518081 -2.038934 0.93944
C  3.019809 1.991767 0.568807
C  2.662102 -2.130323 -1.458006
C  2.784236 3.090618 1.38164
C  3.280949 -2.137845 -0.215708
H  -3.809595 0.727423 1.711339
H  -4.96235 0.680632 0.376527
H  -0.508665 3.544364 0.734568
H  0.541469 -1.869602 1.759468
H  2.167967 0.589291 -0.816604
H  0.794665 -1.990286 -2.511512
H  -4.66634 -1.820356 0.228778
H  -3.560922 -1.758532 1.607728
H  -5.249844 -1.309161 1.812284
H  1.328258 4.503877 2.079878
H  2.998255 -2.038894 1.908845
H  4.006243 1.549911 0.520715
H  3.252723 -2.205022 -2.361615
H  3.589394 3.51266 1.968626
H  4.357684 -2.222303 -0.147901
totalener: -1830.88063831 hartree
nucrepener: 1910.28450719 hartree
electener: -3741.16514550 hartree
oneelecener: -6315.06589034 hartree
twoeener: 2573.90074484 hartree
kineticenergy: 1825.76735672 hartree
xcener: -123.394791554887 hartree
chargesum: 0.0000000
charge: -0.135688 -0.134725 0.662783 -0.347043 -0.503257 -0.004154 0.010603 0.026833 -0.023728 -0.037245 -0.034049 -0.095999 -0.259377 -0.170058 -0.151379 -0.205570 -0.139418 -0.060878 -0.114326 0.096158 0.092038 0.110535 0.127487 0.146007 0.117881 0.091073 0.093249 0.087085 0.123816 0.127223 0.120209 0.128005 0.127131 0.128779
qa: -0.1357 -0.1347 0.6628 -0.3470 -0.5033 -0.0042 0.0106 0.0268 -0.0237 -0.0372 -0.0340 -0.0960 -0.2594 -0.1701 -0.1514 -0.2056 -0.1394 -0.0609 -0.1143 0.0962 0.0920 0.1105 0.1275 0.1460 0.1179 0.0911 0.0932 0.0871 0.1238 0.1272 0.1202 0.1280 0.1271 0.1288
va: 2.3109 2.3070 5.3948 2.1210 2.0973 3.8935 3.8131 3.9081 3.9293 3.8726 3.8119 3.9231 3.8959 4.0057 3.9479 4.0272 3.9398 3.9018 3.8927 1.0039 0.9887 1.0080 1.0196 0.9777 1.0202 1.0026 1.0165 1.0145 1.0005 1.0012 1.0062 1.0001 0.9975 0.9997
dispcorr: -0.018860576 hartree
energy: -1830.899498883996
dipole: 2.09876 -1.72321 0.37555 -1.12631 1.08137 -0.04494 6.89483 -6.81463 0.08020
magnitude: 0.38664 au
magnitude: 0.98275 debye
