program: Orca
programVersion: 5.0.2
elementType: S S P O O C C C C C C C C C C C C C C H H H H H H H H H H H H H H H
charge: 0
multiplicity: 1
keywords: wb97x-d3
keywords: def2-TZVPP
keywords: def2/J RIJCOSX
keywords: DEFGRID2
keywords: scfconv7
keywords: smallprint printgap noloewdin
keywords: NOSOSCF
formula: C14H15O2PS2
InChI: InChI=1/C14H15O2PS2/c1-2-16-17(15,18-13-9-5-3-6-10-13)19-14-11-7-4-8-12-14/h3-12H,2H2,1H3
34 atoms
S  -1.339305 1.723479 -0.188185
S  -0.6050 -1.4189 -1.326338
P  -1.636522 -0.32741 0.133906
O  -3.118467 -0.450007 -0.458087
O  -1.411016 -0.777678 1.523305
C  0.420812 1.833157 0.028148
C  0.947435 -1.676306 -0.497595
C  -4.239938 -0.712835 0.400512
C  1.17279 2.349388 -1.021233
C  2.089031 -1.088713 -1.027205
C  1.035379 1.477725 1.224144
C  1.034574 -2.513668 0.608706
C  -4.661017 0.517859 1.171273
C  2.540863 2.519359 -0.870118
C  3.321807 -1.33483 -0.44388
C  2.406448 1.626528 1.355016
C  2.269857 -2.742893 1.193558
C  3.159482 2.153775 0.315628
C  3.413427 -2.157774 0.668325
H  -5.031665 -1.044413 -0.270024
H  -4.007082 -1.535609 1.078835
H  0.686977 2.617722 -1.950129
H  2.009223 -0.430383 -1.881327
H  0.448643 1.075383 2.037981
H  0.144482 -2.974519 1.011649
H  -4.869853 1.352497 0.50257
H  -5.569602 0.303354 1.734539
H  -3.894769 0.825095 1.882488
H  3.122356 2.933077 -1.68373
H  4.208916 -0.871334 -0.854388
H  2.887493 1.332471 2.27805
H  2.338505 -3.388696 2.059167
H  4.227861 2.280914 0.431146
H  4.376229 -2.3461 1.125193
totalener: -1830.88054937 hartree
nucrepener: 1928.49307168 hartree
electener: -3759.37362105 hartree
oneelecener: -6351.43181592 hartree
twoeener: 2592.05819487 hartree
kineticenergy: 1825.76807227 hartree
xcener: -123.397611784207 hartree
chargesum: -0.0000000
charge: -0.117760 -0.117813 0.679637 -0.354506 -0.511881 0.045131 0.008040 0.032321 -0.139365 -0.058443 -0.093823 -0.053377 -0.260756 -0.121619 -0.168985 -0.108365 -0.150568 -0.130652 -0.089327 0.092863 0.093971 0.121350 0.123442 0.138530 0.115809 0.089734 0.086256 0.099073 0.127156 0.119131 0.125022 0.126359 0.126700 0.126717
qa: -0.1178 -0.1178 0.6796 -0.3545 -0.5119 0.0451 0.0080 0.0323 -0.1394 -0.0584 -0.0938 -0.0534 -0.2608 -0.1216 -0.1690 -0.1084 -0.1506 -0.1307 -0.0893 0.0929 0.0940 0.1214 0.1234 0.1385 0.1158 0.0897 0.0863 0.0991 0.1272 0.1191 0.1250 0.1264 0.1267 0.1267
va: 2.3351 2.3327 5.3815 2.1158 2.0840 3.8022 3.8387 3.9032 3.9359 3.8307 3.8643 3.9326 3.9004 3.9272 3.9760 3.8777 3.9879 3.9040 3.9034 0.9891 1.0037 1.0180 1.0120 1.0171 1.0203 1.0036 1.0139 1.0155 0.9985 1.0050 1.0017 0.9995 0.9993 0.9977
dispcorr: -0.020207200 hartree
energy: -1830.900756566600
dipole: 2.68758 -2.19962 0.48796 1.10207 -0.95369 0.14838 6.23692 -6.26022 -0.02330
magnitude: 0.51056 au
magnitude: 1.29773 debye
