program: Orca
programVersion: 5.0.2
elementType: S S P O O C C C C C C C C C C C C C C H H H H H H H H H H H H H H H
charge: 0
multiplicity: 1
keywords: wb97x-d3
keywords: def2-TZVPP
keywords: def2/J RIJCOSX
keywords: DEFGRID2
keywords: scfconv7
keywords: smallprint printgap noloewdin
keywords: NOSOSCF
formula: C14H15O2PS2
InChI: InChI=1/C14H15O2PS2/c1-2-16-17(15,18-13-9-5-3-6-10-13)19-14-11-7-4-8-12-14/h3-12H,2H2,1H3
34 atoms
S  -0.423793 0.870516 -1.167322
S  -0.444945 -1.049022 1.639142
P  -1.627223 0.091885 0.355065
O  -2.459631 -0.93529 -0.556986
O  -2.428904 1.02938 1.166368
C  0.744696 1.834415 -0.242121
C  0.675923 -1.874307 0.5390
C  -3.858608 -0.715375 -0.80481
C  2.095674 1.616538 -0.489302
C  0.23795 -2.857065 -0.340931
C  0.343035 2.824962 0.646754
C  2.028649 -1.568514 0.632132
C  -4.087279 0.372318 -1.829808
C  3.046878 2.392058 0.15542
C  1.155655 -3.512784 -1.14574
C  1.303514 3.57959 1.302311
C  2.942154 -2.241568 -0.164738
C  2.652715 3.369832 1.056725
C  2.50693 -3.208697 -1.058618
H  -4.23241 -1.673844 -1.163198
H  -4.371578 -0.481911 0.129531
H  2.397149 0.839264 -1.179125
H  -0.812539 -3.105404 -0.395951
H  -0.707865 2.999973 0.82987
H  2.359508 -0.802733 1.320914
H  -5.151875 0.443877 -2.05434
H  -3.76138 1.343942 -1.459692
H  -3.56035 0.160168 -2.759745
H  4.097414 2.226199 -0.04417
H  0.814359 -4.271739 -1.837036
H  0.992319 4.343486 2.002056
H  3.99551 -2.005973 -0.087362
H  3.395658 3.970654 1.564369
H  3.220149 -3.729991 -1.683371
totalener: -1830.88184877 hartree
nucrepener: 1908.54188783 hartree
electener: -3739.42373660 hartree
oneelecener: -6311.26863091 hartree
twoeener: 2571.84489431 hartree
kineticenergy: 1825.76950470 hartree
xcener: -123.398216137480 hartree
chargesum: 0.0000000
charge: -0.116869 -0.101619 0.666940 -0.342989 -0.521290 0.032215 -0.004217 0.028686 -0.111274 -0.056981 -0.082502 -0.091889 -0.254706 -0.153641 -0.154531 -0.148883 -0.166346 -0.091170 -0.080274 0.087461 0.097318 0.126931 0.124353 0.139304 0.135120 0.086712 0.098424 0.087243 0.125566 0.126804 0.129009 0.128525 0.128749 0.129822
qa: -0.1169 -0.1016 0.6669 -0.3430 -0.5213 0.0322 -0.0042 0.0287 -0.1113 -0.0570 -0.0825 -0.0919 -0.2547 -0.1536 -0.1545 -0.1489 -0.1663 -0.0912 -0.0803 0.0875 0.0973 0.1269 0.1244 0.1393 0.1351 0.0867 0.0984 0.0872 0.1256 0.1268 0.1290 0.1285 0.1287 0.1298
va: 2.3324 2.3410 5.3908 2.0912 2.0959 3.8218 3.8348 3.9023 3.8830 3.9108 3.9353 3.8575 3.8968 3.9756 3.9869 3.9901 3.9676 3.9275 3.9200 0.9901 1.0047 1.0065 1.0148 1.0201 1.0006 1.0142 1.0174 1.0042 1.0005 1.0000 1.0001 1.0000 0.9976 0.9970
dispcorr: -0.018539924 hartree
energy: -1830.900388696935
dipole: 0.84996 -0.09070 0.75926 0.20598 -0.70512 -0.49914 -7.05912 6.23034 -0.82878
magnitude: 1.22984 au
magnitude: 3.12599 debye
