program: Orca
programVersion: 5.0.2
elementType: S S P O O C C C C C C C C C C C C C C H H H H H H H H H H H H H H H
charge: 0
multiplicity: 1
keywords: wb97x-d3
keywords: def2-TZVPP
keywords: def2/J RIJCOSX
keywords: DEFGRID2
keywords: scfconv7
keywords: smallprint printgap noloewdin
keywords: NOSOSCF
formula: C14H15O2PS2
InChI: InChI=1/C14H15O2PS2/c1-2-16-17(15,18-13-9-5-3-6-10-13)19-14-11-7-4-8-12-14/h3-12H,2H2,1H3
34 atoms
S  -0.842448 1.760481 -0.639419
S  -1.09203 -1.645589 -0.941637
P  -1.643665 0.020882 0.208036
O  -3.161611 0.180025 -0.274802
O  -1.398616 -0.130471 1.657192
C  0.734554 1.807317 0.183172
C  0.670895 -1.627797 -0.715422
C  -4.244544 -0.233426 0.57597
C  0.821498 2.065756 1.546105
C  1.467637 -1.602161 -1.854219
C  1.885429 1.658351 -0.579693
C  1.251272 -1.694842 0.546969
C  -4.40297 -1.736684 0.611851
C  2.068808 2.153547 2.14362
C  2.847989 -1.648132 -1.730339
C  3.128205 1.763182 0.024155
C  2.631714 -1.709034 0.660207
C  3.221678 2.00652 1.385873
C  3.431464 -1.693104 -0.473558
H  -4.099166 0.165338 1.581465
H  -5.127542 0.240666 0.150015
H  -0.076671 2.187532 2.133442
H  1.007051 -1.544957 -2.831676
H  1.806596 1.448061 -1.637191
H  0.630822 -1.716365 1.431504
H  -5.293191 -1.994355 1.186223
H  -4.519093 -2.14933 -0.389923
H  -3.551004 -2.220487 1.088865
H  2.13843 2.345398 3.20615
H  3.465732 -1.638825 -2.61876
H  4.023085 1.641869 -0.571117
H  3.083866 -1.737179 1.642371
H  4.192579 2.083816 1.85742
H  4.508897 -1.7166 -0.376403
totalener: -1830.88051983 hartree
nucrepener: 1933.84898760 hartree
electener: -3764.72950743 hartree
oneelecener: -6362.14095265 hartree
twoeener: 2597.41144522 hartree
kineticenergy: 1825.77499939 hartree
xcener: -123.400054587487 hartree
chargesum: -0.0000000
charge: -0.115679 -0.121809 0.686263 -0.354444 -0.513745 0.002289 0.054364 0.030982 -0.054207 -0.144021 -0.056235 -0.104358 -0.262105 -0.148972 -0.115474 -0.165249 -0.104992 -0.091462 -0.133002 0.096199 0.092298 0.117691 0.120850 0.121513 0.139959 0.087002 0.090588 0.097884 0.126366 0.125814 0.119530 0.124391 0.125765 0.126004
qa: -0.1157 -0.1218 0.6863 -0.3544 -0.5137 0.0023 0.0544 0.0310 -0.0542 -0.1440 -0.0562 -0.1044 -0.2621 -0.1490 -0.1155 -0.1652 -0.1050 -0.0915 -0.1330 0.0962 0.0923 0.1177 0.1208 0.1215 0.1400 0.0870 0.0906 0.0979 0.1264 0.1258 0.1195 0.1244 0.1258 0.1260
va: 2.3322 2.3325 5.3772 2.1209 2.0817 3.8377 3.7942 3.9019 3.9267 3.9376 3.8336 3.8665 3.8973 3.9798 3.9290 3.9631 3.8721 3.9003 3.9068 1.0041 0.9891 1.0209 1.0176 1.0131 1.0187 1.0144 1.0031 1.0152 0.9994 0.9986 1.0046 1.0018 0.9982 0.9997
dispcorr: -0.020460278 hartree
energy: -1830.900980109131
dipole: 3.39973 -2.89771 0.50203 -4.11268 3.98138 -0.13131 4.87545 -4.96547 -0.09002
magnitude: 0.52666 au
magnitude: 1.33867 debye
