program: Orca
programVersion: 5.0.2
elementType: S S P O O C C C C C C C C C C C C C C H H H H H H H H H H H H H H H
charge: 0
multiplicity: 1
keywords: wb97x-d3
keywords: def2-TZVPP
keywords: def2/J RIJCOSX
keywords: DEFGRID2
keywords: scfconv7
keywords: smallprint printgap noloewdin
keywords: NOSOSCF
formula: C14H15O2PS2
InChI: InChI=1/C14H15O2PS2/c1-2-16-17(15,18-13-9-5-3-6-10-13)19-14-11-7-4-8-12-14/h3-12H,2H2,1H3
34 atoms
S  -1.17079 2.136834 0.209182
S  -0.807029 -0.952267 -1.189978
P  -1.657898 0.113638 0.407799
O  -3.1825 0.22819 -0.063542
O  -1.398847 -0.4871 1.732489
C  0.599737 1.983655 0.218512
C  0.766171 -1.445103 -0.526627
C  -4.186223 -0.654466 0.468183
C  1.277037 1.469779 1.319254
C  0.863687 -2.273846 0.585489
C  1.303338 2.441598 -0.888497
C  1.909325 -1.051619 -1.210537
C  -4.150517 -2.025138 -0.168574
C  2.66005 1.399903 1.295535
C  2.113237 -2.684069 1.020553
C  2.689313 2.395356 -0.889635
C  3.152982 -1.485104 -0.779687
C  3.367682 1.868197 0.198073
C  3.258354 -2.296288 0.338872
H  -4.077193 -0.726898 1.551592
H  -5.131329 -0.155857 0.258905
H  0.726175 1.114772 2.178946
H  -0.026242 -2.584737 1.111775
H  0.766871 2.831922 -1.742915
H  1.825524 -0.398404 -2.067916
H  -4.997032 -2.610653 0.191667
H  -4.221998 -1.963193 -1.25388
H  -3.240506 -2.567783 0.083726
H  3.186002 0.978307 2.141127
H  2.189969 -3.320903 1.891752
H  3.236703 2.76323 -1.74747
H  4.040673 -1.175365 -1.314814
H  4.44849 1.820434 0.191035
H  4.230345 -2.628697 0.678488
totalener: -1830.88083882 hartree
nucrepener: 1938.36767093 hartree
electener: -3769.24850976 hartree
oneelecener: -6371.13259155 hartree
twoeener: 2601.88408180 hartree
kineticenergy: 1825.78551934 hartree
xcener: -123.402464031733 hartree
chargesum: -0.0000000
charge: -0.100316 -0.135330 0.679603 -0.349977 -0.511652 0.030614 0.040668 0.024542 -0.101189 -0.066797 -0.130837 -0.062765 -0.252040 -0.108017 -0.152287 -0.130728 -0.172499 -0.119291 -0.092947 0.099455 0.094170 0.142650 0.118354 0.119840 0.120261 0.087454 0.090229 0.089405 0.124325 0.127099 0.126623 0.119902 0.126034 0.125444
qa: -0.1003 -0.1353 0.6796 -0.3500 -0.5117 0.0306 0.0407 0.0245 -0.1012 -0.0668 -0.1308 -0.0628 -0.2520 -0.1080 -0.1523 -0.1307 -0.1725 -0.1193 -0.0929 0.0995 0.0942 0.1427 0.1184 0.1198 0.1203 0.0875 0.0902 0.0894 0.1243 0.1271 0.1266 0.1199 0.1260 0.1254
va: 2.3451 2.3127 5.3927 2.1256 2.0860 3.8040 3.8036 3.8999 3.8684 3.9172 3.9405 3.8337 3.9062 3.8743 3.9867 3.9265 3.9802 3.8943 3.9038 1.0051 0.9890 1.0147 1.0212 1.0180 1.0130 1.0132 1.0041 1.0111 1.0023 0.9995 0.9990 1.0044 0.9997 0.9983
dispcorr: -0.020671899 hartree
energy: -1830.901510722148
dipole: 4.13499 -3.59016 0.54483 -8.24516 7.95122 -0.29394 0.78231 -1.14243 -0.36012
magnitude: 0.71619 au
magnitude: 1.82040 debye
