program: Orca
programVersion: 5.0.2
elementType: S S P O O C C C C C C C C C C C C C C H H H H H H H H H H H H H H H
charge: 0
multiplicity: 1
keywords: wb97x-d3
keywords: def2-TZVPP
keywords: def2/J RIJCOSX
keywords: DEFGRID2
keywords: scfconv7
keywords: smallprint printgap noloewdin
keywords: NOSOSCF
formula: C14H15O2PS2
InChI: InChI=1/C14H15O2PS2/c1-2-16-17(15,18-13-9-5-3-6-10-13)19-14-11-7-4-8-12-14/h3-12H,2H2,1H3
34 atoms
S  -0.366829 1.347853 -1.24753
S  -0.621342 -0.901213 1.292939
P  -1.688445 0.441338 0.088443
O  -2.510648 -0.378917 -1.020256
O  -2.496831 1.289761 0.986013
C  0.900368 1.859034 -0.113527
C  0.60995 -1.610071 0.23252
C  -3.882541 -0.738643 -0.786399
C  2.199644 1.434106 -0.362446
C  0.309039 -2.21914 -0.980566
C  0.623876 2.688752 0.967521
C  1.92025 -1.59499 0.698366
C  -4.026651 -1.874226 0.202737
C  3.225703 1.838508 0.47742
C  1.325684 -2.789874 -1.730244
C  1.653426 3.067834 1.814042
C  2.926251 -2.191253 -0.045254
C  2.953445 2.647278 1.570485
C  2.632756 -2.783465 -1.264409
H  -4.439857 0.138303 -0.453088
H  -4.263283 -1.027568 -1.76535
H  2.401348 0.77648 -1.19761
H  -0.708365 -2.243028 -1.344202
H  -0.387523 3.024169 1.152573
H  2.15169 -1.101475 1.632953
H  -5.073422 -2.176233 0.253369
H  -3.440357 -2.74346 -0.094375
H  -3.719552 -1.581284 1.205975
H  4.237165 1.507105 0.282636
H  1.091208 -3.25265 -2.67966
H  1.437654 3.700338 2.664577
H  3.942784 -2.179819 0.325291
H  3.753799 2.951341 2.23203
H  3.419353 -3.241099 -1.849513
totalener: -1830.88054069 hartree
nucrepener: 1929.96679681 hartree
electener: -3760.84733750 hartree
oneelecener: -6354.00566616 hartree
twoeener: 2593.15832866 hartree
kineticenergy: 1825.76968523 hartree
xcener: -123.400521896108 hartree
chargesum: 0.0000000
charge: -0.100228 -0.113708 0.656587 -0.340041 -0.512231 0.004551 0.039846 0.019211 -0.080574 -0.104747 -0.087962 -0.070434 -0.254372 -0.164355 -0.144228 -0.139206 -0.159753 -0.099584 -0.103809 0.105651 0.094157 0.129036 0.121311 0.141395 0.123968 0.089871 0.085127 0.096667 0.125423 0.127918 0.129790 0.126784 0.128642 0.129297
qa: -0.1002 -0.1137 0.6566 -0.3400 -0.5122 0.0046 0.0398 0.0192 -0.0806 -0.1047 -0.0880 -0.0704 -0.2544 -0.1644 -0.1442 -0.1392 -0.1598 -0.0996 -0.1038 0.1057 0.0942 0.1290 0.1213 0.1414 0.1240 0.0899 0.0851 0.0967 0.1254 0.1279 0.1298 0.1268 0.1286 0.1293
va: 2.3386 2.3195 5.4052 2.0927 2.1175 3.8334 3.7815 3.8832 3.8586 3.9123 3.9297 3.8499 3.9211 3.9704 3.9962 3.9839 3.9675 3.9276 3.9257 1.0068 0.9908 1.0053 1.0170 1.0164 1.0130 1.0135 1.0028 1.0098 1.0021 1.0001 0.9995 1.0010 0.9981 0.9985
dispcorr: -0.019836259 hartree
energy: -1830.900376949729
dipole: 1.97167 -1.12257 0.84910 -7.71413 6.83768 -0.87644 -0.25420 -0.22166 -0.47586
magnitude: 1.30980 au
magnitude: 3.32924 debye
