program: Orca
programVersion: 5.0.2
elementType: S S P O O C C C C C C C C C C C C C C H H H H H H H H H H H H H H H
charge: 0
multiplicity: 1
keywords: wb97x-d3
keywords: def2-TZVPP
keywords: def2/J RIJCOSX
keywords: DEFGRID2
keywords: scfconv7
keywords: smallprint printgap noloewdin
keywords: NOSOSCF
formula: C14H15O2PS2
InChI: InChI=1/C14H15O2PS2/c1-2-16-17(15,18-13-9-5-3-6-10-13)19-14-11-7-4-8-12-14/h3-12H,2H2,1H3
34 atoms
S  -0.444494 0.854629 1.464405
S  -0.208944 -1.176847 -1.261597
P  -1.446835 -0.574438 0.305085
O  -2.51853 0.16613 -0.633334
O  -1.985643 -1.589622 1.231655
C  0.435921 1.830859 0.273618
C  1.192055 -1.751875 -0.335157
C  -3.893761 0.268795 -0.231959
C  -0.215064 2.578799 -0.70111
C  2.435044 -1.204613 -0.630301
C  1.820447 1.887002 0.386923
C  1.075083 -2.76615 0.609157
C  -4.10576 1.262986 0.888211
C  0.525252 3.358525 -1.575123
C  3.563838 -1.670361 0.026272
C  2.552336 2.685509 -0.478698
C  2.207087 -3.209026 1.274981
C  1.907406 3.415581 -1.465904
C  3.450728 -2.666845 0.984368
H  -4.420954 0.582973 -1.132085
H  -4.268164 -0.716616 0.050493
H  -1.292301 2.549667 -0.781184
H  2.513561 -0.413695 -1.364414
H  2.319976 1.298681 1.145168
H  0.10863 -3.198738 0.827565
H  -3.700626 2.243678 0.638898
H  -5.17513 1.378211 1.06803
H  -3.648621 0.929895 1.819034
H  0.018056 3.931285 -2.340229
H  4.53203 -1.247955 -0.208299
H  3.629317 2.730232 -0.383618
H  2.11518 -3.989372 2.018586
H  2.479785 4.032331 -2.146029
H  4.331405 -3.023673 1.501645
totalener: -1830.88179777 hartree
nucrepener: 1917.22525485 hartree
electener: -3748.10705262 hartree
oneelecener: -6328.58110374 hartree
twoeener: 2580.47405112 hartree
kineticenergy: 1825.76769564 hartree
xcener: -123.398676460865 hartree
chargesum: -0.0000000
charge: -0.113999 -0.102349 0.660613 -0.339036 -0.515873 0.011782 0.010516 0.021418 -0.055306 -0.103050 -0.081341 -0.076134 -0.260069 -0.166184 -0.158189 -0.172645 -0.151498 -0.076750 -0.088040 0.094360 0.104184 0.114285 0.129845 0.130433 0.140111 0.084555 0.091040 0.099612 0.126853 0.125947 0.127940 0.129064 0.129234 0.128671
qa: -0.1140 -0.1023 0.6606 -0.3390 -0.5159 0.0118 0.0105 0.0214 -0.0553 -0.1030 -0.0813 -0.0761 -0.2601 -0.1662 -0.1582 -0.1726 -0.1515 -0.0768 -0.0880 0.0944 0.1042 0.1143 0.1298 0.1304 0.1401 0.0846 0.0910 0.0996 0.1269 0.1259 0.1279 0.1291 0.1292 0.1287
va: 2.3154 2.3381 5.4031 2.0941 2.1115 3.8107 3.8312 3.8826 3.8873 3.8803 3.8544 3.9391 3.9236 4.0187 3.9731 3.9731 3.9951 3.9135 3.9241 0.9904 1.0059 1.0100 1.0021 1.0057 1.0172 1.0012 1.0135 1.0095 1.0005 1.0008 1.0005 0.9999 0.9973 0.9975
dispcorr: -0.019205942 hartree
energy: -1830.901003710864
dipole: 0.08404 0.48217 0.56622 6.95875 -6.01307 0.94568 -0.21609 -0.34212 -0.55822
magnitude: 1.23552 au
magnitude: 3.14045 debye
