program: Orca
programVersion: 5.0.2
elementType: S S P O O C C C C C C C C C C C C C C H H H H H H H H H H H H H H H
charge: 0
multiplicity: 1
keywords: wb97x-d3
keywords: def2-TZVPP
keywords: def2/J RIJCOSX
keywords: DEFGRID2
keywords: scfconv7
keywords: smallprint printgap noloewdin
keywords: NOSOSCF
formula: C14H15O2PS2
InChI: InChI=1/C14H15O2PS2/c1-2-16-17(15,18-13-9-5-3-6-10-13)19-14-11-7-4-8-12-14/h3-12H,2H2,1H3
34 atoms
S  0.738481 0.624062 1.313242
S  -1.01248 -2.158126 1.181142
P  -1.073599 -0.146583 0.612958
O  -0.855228 -0.096429 -0.973218
O  -2.307171 0.483495 1.121222
C  0.566381 2.225382 0.556381
C  0.385798 -2.741423 0.251736
C  -1.960794 0.184668 -1.847172
C  1.305995 2.526842 -0.580354
C  0.223431 -3.146027 -1.067614
C  -0.29717 3.165528 1.106295
C  1.625577 -2.848816 0.869088
C  -2.169109 1.671839 -2.015051
C  1.189731 3.780629 -1.160382
C  1.306934 -3.64723 -1.77067
C  -0.416479 4.412849 0.512308
C  2.704892 -3.355415 0.161465
C  0.327472 4.722651 -0.617012
C  2.547504 -3.752268 -1.157986
H  -1.695481 -0.283737 -2.795307
H  -2.871898 -0.295677 -1.482142
H  1.963632 1.781045 -1.005719
H  -0.74801 -3.073774 -1.536956
H  -0.874355 2.916924 1.985909
H  1.742671 -2.536462 1.898087
H  -1.256491 2.163875 -2.350074
H  -2.944383 1.849941 -2.761302
H  -2.48701 2.132931 -1.081702
H  1.769336 4.019805 -2.042129
H  1.180627 -3.960713 -2.798385
H  -1.091735 5.144529 0.93585
H  3.669984 -3.438383 0.643038
H  0.2366 5.699389 -1.073613
H  3.390914 -4.147632 -1.708361
totalener: -1830.88182086 hartree
nucrepener: 1898.06117938 hartree
electener: -3728.94300024 hartree
oneelecener: -6290.36257614 hartree
twoeener: 2561.41957589 hartree
kineticenergy: 1825.77534885 hartree
xcener: -123.395756757366 hartree
chargesum: -0.0000000
charge: -0.140429 -0.122322 0.645309 -0.316732 -0.515028 0.085051 0.028780 0.028837 -0.124889 -0.081578 -0.105677 -0.086684 -0.254594 -0.148236 -0.148421 -0.141259 -0.143643 -0.086815 -0.096264 0.089505 0.096474 0.121057 0.115056 0.131152 0.127229 0.081576 0.089954 0.102339 0.127398 0.126232 0.129767 0.128057 0.129302 0.129498
qa: -0.1404 -0.1223 0.6453 -0.3167 -0.5150 0.0851 0.0288 0.0288 -0.1249 -0.0816 -0.1057 -0.0867 -0.2546 -0.1482 -0.1484 -0.1413 -0.1436 -0.0868 -0.0963 0.0895 0.0965 0.1211 0.1151 0.1312 0.1272 0.0816 0.0900 0.1023 0.1274 0.1262 0.1298 0.1281 0.1293 0.1295
va: 2.3015 2.3227 5.4370 2.0834 2.1057 3.7982 3.8197 3.8812 3.9491 3.9556 3.9495 3.9177 3.9254 3.9380 3.9807 3.9608 3.9884 3.9117 3.9354 0.9903 1.0019 1.0152 1.0062 1.0143 1.0083 1.0034 1.0152 1.0158 1.0000 1.0001 0.9994 0.9996 0.9979 0.9978
dispcorr: -0.018623927 hartree
energy: -1830.900444789549
dipole: 1.09588 -0.18339 0.91248 7.70556 -7.54600 0.15957 -15.05786 13.58757 -1.47029
magnitude: 1.73776 au
magnitude: 4.41705 debye
