program: Orca
programVersion: 5.0.2
elementType: S S P O O C C C C C C C C C C C C C C H H H H H H H H H H H H H H H
charge: 0
multiplicity: 1
keywords: wb97x-d3
keywords: def2-TZVPP
keywords: def2/J RIJCOSX
keywords: DEFGRID2
keywords: scfconv7
keywords: smallprint printgap noloewdin
keywords: NOSOSCF
formula: C14H15O2PS2
InChI: InChI=1/C14H15O2PS2/c1-2-16-17(15,18-13-9-5-3-6-10-13)19-14-11-7-4-8-12-14/h3-12H,2H2,1H3
34 atoms
S  1.024492 0.755667 1.073138
S  -0.410244 -2.142123 1.543575
P  -0.837183 -0.184738 0.936261
O  -1.077404 -0.222604 -0.645656
O  -1.93391 0.381299 1.744702
C  0.545982 2.297622 0.328671
C  0.601817 -2.724329 0.203881
C  -2.406729 -0.079724 -1.174268
C  -0.149158 3.2412 1.07518
C  1.985403 -2.623858 0.277384
C  0.88542 2.554305 -0.993898
C  0.002183 -3.34553 -0.884862
C  -2.784916 1.375175 -1.32724
C  -0.498823 4.449772 0.492525
C  2.766959 -3.137141 -0.746446
C  0.538401 3.76812 -1.566216
C  0.788691 -3.859192 -1.903284
C  -0.154551 4.714937 -0.82493
C  2.170634 -3.754613 -1.835807
H  -2.381144 -0.584491 -2.139709
H  -3.129375 -0.603099 -0.544046
H  -0.414297 3.026417 2.101047
H  2.446757 -2.147191 1.131594
H  1.414641 1.804794 -1.566435
H  -1.075218 -3.430071 -0.927717
H  -3.759361 1.4499 -1.811749
H  -2.851193 1.867686 -0.358897
H  -2.059654 1.911099 -1.93872
H  -1.040383 5.185956 1.071256
H  3.844324 -3.056857 -0.689381
H  0.806758 3.972468 -2.594156
H  0.321228 -4.344581 -2.749658
H  -0.425399 5.661229 -1.274204
H  2.783131 -4.159351 -2.630783
totalener: -1830.88175514 hartree
nucrepener: 1893.87154222 hartree
electener: -3724.75329736 hartree
oneelecener: -6281.97247763 hartree
twoeener: 2557.21918027 hartree
kineticenergy: 1825.77671234 hartree
xcener: -123.395187317946 hartree
chargesum: 0.0000000
charge: -0.145757 -0.125394 0.643524 -0.316983 -0.513727 0.086409 0.041142 0.026860 -0.106408 -0.083705 -0.127349 -0.094010 -0.250582 -0.135667 -0.148827 -0.144100 -0.143841 -0.090311 -0.096780 0.090948 0.096398 0.130073 0.127214 0.121411 0.116405 0.089487 0.101475 0.080523 0.129821 0.128369 0.127529 0.126127 0.129760 0.129966
qa: -0.1458 -0.1254 0.6435 -0.3170 -0.5137 0.0864 0.0411 0.0269 -0.1064 -0.0837 -0.1273 -0.0940 -0.2506 -0.1357 -0.1488 -0.1441 -0.1438 -0.0903 -0.0968 0.0909 0.0964 0.1301 0.1272 0.1214 0.1164 0.0895 0.1015 0.0805 0.1298 0.1284 0.1275 0.1261 0.1298 0.1300
va: 2.2983 2.3188 5.4411 2.0857 2.1070 3.7962 3.8099 3.8818 3.9605 3.9344 3.9488 3.9613 3.9248 3.9619 3.9941 3.9348 3.9800 3.9177 3.9363 0.9904 1.0019 1.0129 1.0056 1.0148 1.0090 1.0151 1.0169 1.0036 0.9992 0.9999 0.9998 1.0001 0.9979 0.9977
dispcorr: -0.018419888 hartree
energy: -1830.900175032198
dipole: -4.13480 4.54293 0.40814 6.63058 -6.50281 0.12777 -15.26733 13.55588 -1.71145
magnitude: 1.76408 au
magnitude: 4.48393 debye
