program: Orca
programVersion: 5.0.2
elementType: S S P O O C C C C C C C C C C C C C C H H H H H H H H H H H H H H H
charge: 0
multiplicity: 1
keywords: wb97x-d3
keywords: def2-TZVPP
keywords: def2/J RIJCOSX
keywords: DEFGRID2
keywords: scfconv7
keywords: smallprint printgap noloewdin
keywords: NOSOSCF
formula: C14H15O2PS2
InChI: InChI=1/C14H15O2PS2/c1-2-16-17(15,18-13-9-5-3-6-10-13)19-14-11-7-4-8-12-14/h3-12H,2H2,1H3
34 atoms
S  -0.633957 0.995681 -1.135928
S  -1.052356 -2.294343 -0.714812
P  -1.370246 -0.446906 0.211805
O  -2.95719 -0.418138 0.006074
O  -0.81807 -0.293436 1.569609
C  0.449189 1.904803 -0.063005
C  0.721198 -2.254343 -0.586402
C  -3.737016 0.770234 0.191749
C  0.039647 3.132829 0.437633
C  1.475885 -1.9772 -1.720174
C  1.716506 1.413992 0.222795
C  1.344788 -2.50471 0.630071
C  -3.684812 1.318886 1.6006
C  0.902018 3.873009 1.232061
C  2.860364 -1.960787 -1.637372
C  2.570207 2.156652 1.022114
C  2.728464 -2.476474 0.706724
C  2.166102 3.384669 1.526314
C  3.486815 -2.208445 -0.424455
H  -3.413181 1.525595 -0.529641
H  -4.753228 0.477711 -0.06978
H  -0.949612 3.505742 0.207177
H  0.979011 -1.766692 -2.657243
H  2.028555 0.455685 -0.17089
H  0.749701 -2.706434 1.509179
H  -3.963766 0.562093 2.332301
H  -2.696425 1.692732 1.863499
H  -4.390416 2.146385 1.684656
H  0.583573 4.829353 1.62466
H  3.447935 -1.746648 -2.520107
H  3.5549 1.772004 1.252305
H  3.214543 -2.664677 1.654587
H  2.837349 3.960673 2.149774
H  4.566928 -2.192714 -0.360292
totalener: -1830.88084623 hartree
nucrepener: 1913.82889153 hartree
electener: -3744.70973776 hartree
oneelecener: -6322.05841674 hartree
twoeener: 2577.34867898 hartree
kineticenergy: 1825.77470018 hartree
xcener: -123.397429642996 hartree
chargesum: -0.0000000
charge: -0.171595 -0.119363 0.657927 -0.330237 -0.489836 0.015499 0.012945 -0.002332 -0.060747 -0.103455 0.066039 -0.065073 -0.220962 -0.181454 -0.129417 -0.219873 -0.147417 -0.051105 -0.104944 0.085439 0.098534 0.116461 0.118891 0.085082 0.124893 0.094502 0.085990 0.080182 0.124370 0.127190 0.119880 0.128378 0.126433 0.129176
qa: -0.1716 -0.1194 0.6579 -0.3302 -0.4898 0.0155 0.0129 -0.0023 -0.0607 -0.1035 0.0660 -0.0651 -0.2210 -0.1815 -0.1294 -0.2199 -0.1474 -0.0511 -0.1049 0.0854 0.0985 0.1165 0.1189 0.0851 0.1249 0.0945 0.0860 0.0802 0.1244 0.1272 0.1199 0.1284 0.1264 0.1292
va: 2.2947 2.3151 5.4226 2.1241 2.1038 3.8486 3.8170 3.9245 3.8887 3.9224 3.7983 3.9366 3.8970 4.0320 3.9350 4.0559 3.9607 3.8867 3.9013 1.0046 0.9911 1.0043 1.0198 0.9834 1.0169 1.0092 1.0157 1.0075 1.0010 1.0010 1.0039 1.0008 0.9979 0.9993
dispcorr: -0.018956925 hartree
energy: -1830.899803159636
dipole: 2.83771 -2.47503 0.36268 9.75312 -9.01959 0.73353 6.59529 -6.78062 -0.18533
magnitude: 0.83902 au
magnitude: 2.13262 debye
