program: Orca
programVersion: 5.0.2
elementType: Cl Cl O O C C C C C C C C H H H H H H H H
charge: 0
multiplicity: 1
keywords: wb97x-d3
keywords: def2-TZVPP
keywords: def2/J RIJCOSX
keywords: DEFGRID2
keywords: scfconv7
keywords: smallprint printgap noloewdin
keywords: NOSOSCF
formula: C8H8Cl2O2
InChI: InChI=1/C8H8Cl2O2/c1-11-7-3-6(10)8(12-2)4-5(7)9/h3-4H,1-2H3
20 atoms
Cl 2.658951 -1.636749 0.018256
Cl -2.649421 1.557293 0.204682
O  2.430909 1.212457 -0.170602
O  -2.391918 -1.380462 0.406925
C  1.223693 0.645991 -0.039538
C  -1.215149 -0.718541 0.248779
C  1.180723 -0.748338 0.064791
C  -1.17467 0.664092 0.142121
C  0.024618 1.34768 0.003748
C  -0.01677 -1.419489 0.20184
C  2.503015 2.622338 -0.306792
C  -2.989683 -1.79236 -0.820213
H  0.008848 2.42615 -0.071029
H  -0.029949 -2.498624 0.285412
H  3.557948 2.865006 -0.403313
H  2.101626 3.135715 0.569633
H  1.977435 2.968775 -1.199555
H  -3.25091 -0.938648 -1.449102
H  -3.89894 -2.334071 -0.568046
H  -2.327972 -2.455234 -1.381933
elementType: Cl O C H
totalener: -1380.55327189 hartree
nucrepener: 887.21990084 hartree
electener: -2267.77317273 hartree
oneelecener: -3660.28329933 hartree
twoeener: 1392.51012660 hartree
cpcmener: -0.01647046 hartree
kineticenergy: 1377.30440911 hartree
xcener: -85.991184703970 hartree
chargesum: 0.0000000
charge: -0.086268 -0.079666 -0.323990 -0.381309 0.288644 0.151833 -0.020290 0.000399 -0.173220 -0.107072 -0.123950 -0.096628 0.126116 0.133212 0.125803 0.117652 0.118801 0.097636 0.124265 0.108034
qa: -0.0863 -0.0797 -0.3240 -0.3813 0.2886 0.1518 -0.0203 0.0004 -0.1732 -0.1071 -0.1239 -0.0966 0.1261 0.1332 0.1258 0.1177 0.1188 0.0976 0.1243 0.1080
va: 1.2260 1.2342 2.0727 1.9643 3.9172 3.9550 3.8702 3.9786 3.9163 4.0276 3.8611 3.8466 1.0298 1.0138 0.9932 0.9860 0.9865 0.9939 0.9925 0.9887
dispcorr: -0.007745088 hartree
energy: -1380.561016975388
dipole: -1.60696 1.60457 -0.00239 2.96222 -2.16913 0.79309 -4.28486 3.45959 -0.82527
magnitude: 1.14458 au
magnitude: 2.90930 debye
