program: Orca
programVersion: 5.0.2
elementType: Cl Cl O O C C C C C C C C H H H H H H H H
charge: 0
multiplicity: 1
keywords: wb97x-d3
keywords: def2-TZVPP
keywords: def2/J RIJCOSX
keywords: DEFGRID2
keywords: scfconv7
keywords: smallprint printgap noloewdin
keywords: NOSOSCF
formula: C8H8Cl2O2
InChI: InChI=1/C8H8Cl2O2/c1-11-7-3-6(10)8(12-2)4-5(7)9/h3-4H,1-2H3
20 atoms
Cl 2.594993 -1.689613 -0.000299
Cl -2.59494 1.689613 0.000334
O  2.489222 1.177851 -0.000469
O  -2.48917 -1.17785 0.000301
C  1.254599 0.646111 -0.000227
C  -1.254547 -0.646111 0.000122
C  1.151069 -0.743575 -0.000209
C  -1.151017 0.743575 0.00013
C  0.075681 1.384376 -0.000042
C  -0.075629 -1.384376 -0.000054
C  2.610218 2.58988 -0.000293
C  -2.610169 -2.589879 -0.001407
H  0.097708 2.465492 -0.000062
H  -0.097656 -2.465492 -0.000009
H  3.675776 2.804977 -0.000598
H  2.162183 3.03695 0.89028
H  2.161633 3.037238 -0.890444
H  -2.16198 -3.03597 -0.892397
H  -3.675728 -2.804974 -0.001512
H  -2.161739 -3.038216 0.888326
elementType: Cl O C H
totalener: -1380.55707423 hartree
nucrepener: 884.56507064 hartree
electener: -2265.12214487 hartree
oneelecener: -3655.09095740 hartree
twoeener: 1389.96881253 hartree
cpcmener: -0.01745287 hartree
kineticenergy: 1377.29630274 hartree
xcener: -85.994256477195 hartree
chargesum: -0.0000000
charge: -0.087354 -0.087353 -0.331224 -0.331219 0.241145 0.241172 -0.041530 -0.041563 -0.137920 -0.137918 -0.123579 -0.123587 0.123629 0.123640 0.125364 0.115743 0.115724 0.115748 0.125367 0.115715
qa: -0.0874 -0.0874 -0.3312 -0.3312 0.2411 0.2412 -0.0415 -0.0416 -0.1379 -0.1379 -0.1236 -0.1236 0.1236 0.1236 0.1254 0.1157 0.1157 0.1157 0.1254 0.1157
va: 1.2277 1.2277 2.0601 2.0601 3.9480 3.9480 3.9291 3.9290 3.8948 3.8948 3.8644 3.8644 1.0300 1.0299 0.9931 0.9863 0.9863 0.9863 0.9931 0.9862
dispcorr: -0.007303401 hartree
energy: -1380.564377631995
dipole: -0.00001 0.00001 -0.00000 0.00000 -0.00000 -0.00000 -0.00533 0.00440 -0.00093
magnitude: 0.00093 au
magnitude: 0.00236 debye
