program: Orca
programVersion: 5.0.2
elementType: Cl Cl O O C C C C C C C C H H H H H H H H
charge: 0
multiplicity: 1
keywords: wb97x-d3
keywords: def2-TZVPP
keywords: def2/J RIJCOSX
keywords: DEFGRID2
keywords: scfconv7
keywords: smallprint printgap noloewdin
keywords: NOSOSCF
formula: C8H8Cl2O2
InChI: InChI=1/C8H8Cl2O2/c1-11-7-3-6(10)8(12-2)4-5(7)9/h3-4H,1-2H3
20 atoms
Cl 2.663462 -1.631413 0.024634
Cl -2.651601 1.554875 0.20626
O  2.428607 1.214692 -0.168043
O  -2.386932 -1.382242 0.40054
C  1.224078 0.648652 -0.039544
C  -1.215167 -0.720353 0.242834
C  1.18293 -0.74603 0.065027
C  -1.17565 0.662839 0.138461
C  0.023251 1.347787 0.002109
C  -0.014235 -1.418303 0.19904
C  2.506575 2.621719 -0.30523
C  -2.994402 -1.794032 -0.819097
H  0.005407 2.426454 -0.071393
H  -0.02574 -2.497476 0.285556
H  3.563291 2.860356 -0.399395
H  2.106885 3.14016 0.569846
H  1.986339 2.971705 -1.200555
H  -3.263744 -0.942183 -1.447988
H  -3.901425 -2.336351 -0.558081
H  -2.339548 -2.457878 -1.388913
elementType: Cl O C H
totalener: -1380.55959811 hartree
nucrepener: 887.25791736 hartree
electener: -2267.81751547 hartree
oneelecener: -3660.30354097 hartree
twoeener: 1392.48602551 hartree
cpcmener: -0.01377046 hartree
kineticenergy: 1377.31126553 hartree
xcener: -85.992290456520 hartree
chargesum: -0.0000000
charge: -0.084443 -0.079139 -0.312249 -0.367095 0.285016 0.147125 -0.017598 0.000531 -0.175824 -0.107518 -0.127150 -0.097718 0.123179 0.130935 0.124900 0.115750 0.116848 0.096639 0.122609 0.105198
qa: -0.0844 -0.0791 -0.3122 -0.3671 0.2850 0.1471 -0.0176 0.0005 -0.1758 -0.1075 -0.1271 -0.0977 0.1232 0.1309 0.1249 0.1158 0.1168 0.0966 0.1226 0.1052
va: 1.2278 1.2348 2.0844 1.9817 3.9216 3.9669 3.8701 3.9821 3.9166 4.0270 3.8681 3.8522 1.0307 1.0148 0.9936 0.9858 0.9864 0.9939 0.9928 0.9888
dispcorr: -0.007744615 hartree
energy: -1380.567342724290
dipole: -1.61950 1.62326 0.00377 2.95155 -2.19579 0.75576 -4.29123 3.50768 -0.78354
magnitude: 1.08864 au
magnitude: 2.76709 debye
