program: Orca
programVersion: 5.0.2
elementType: Cl Cl O O C C C C C C C C H H H H H H H H
charge: 0
multiplicity: 1
keywords: wb97x-d3
keywords: def2-TZVPP
keywords: def2/J RIJCOSX
keywords: DEFGRID2
keywords: scfconv7
keywords: smallprint printgap noloewdin
keywords: NOSOSCF
formula: C8H8Cl2O2
InChI: InChI=1/C8H8Cl2O2/c1-11-7-3-6(10)8(12-2)4-5(7)9/h3-4H,1-2H3
20 atoms
Cl 2.599809 -1.683031 0.000036
Cl -2.59977 1.683029 0.000332
O  2.484877 1.180181 -0.000575
O  -2.484834 -1.18018 0.000512
C  1.253212 0.648778 -0.000175
C  -1.253169 -0.648778 0.000294
C  1.153351 -0.741438 0.000027
C  -1.153307 0.741445 0.00021
C  0.072601 1.384321 -0.000018
C  -0.072562 -1.384318 0.000227
C  2.612517 2.589034 -0.000402
C  -2.612459 -2.589037 -0.001611
H  0.091907 2.465705 -0.000142
H  -0.091857 -2.465701 0.000392
H  3.679764 2.799084 -0.001039
H  2.168966 3.040918 0.890879
H  2.167875 3.041274 -0.890959
H  -2.168676 -3.039662 -0.893415
H  -3.679703 -2.799102 -0.001522
H  -2.168036 -3.042514 0.888422
elementType: Cl O C H
totalener: -1380.56342376 hartree
nucrepener: 884.74567662 hartree
electener: -2265.30910038 hartree
oneelecener: -3655.38958217 hartree
twoeener: 1390.08048179 hartree
cpcmener: -0.01465275 hartree
kineticenergy: 1377.30370019 hartree
xcener: -85.995448313293 hartree
chargesum: 0.0000000
charge: -0.085402 -0.085411 -0.318988 -0.318985 0.237199 0.237260 -0.038752 -0.038768 -0.139807 -0.139832 -0.126977 -0.126973 0.120757 0.120785 0.124239 0.113876 0.113836 0.113886 0.124240 0.113817
qa: -0.0854 -0.0854 -0.3190 -0.3190 0.2372 0.2373 -0.0388 -0.0388 -0.1398 -0.1398 -0.1270 -0.1270 0.1208 0.1208 0.1242 0.1139 0.1138 0.1139 0.1242 0.1138
va: 1.2298 1.2298 2.0721 2.0721 3.9537 3.9536 3.9322 3.9319 3.8968 3.8968 3.8718 3.8718 1.0309 1.0309 0.9935 0.9860 0.9860 0.9861 0.9935 0.9860
dispcorr: -0.007311315 hartree
energy: -1380.570735075103
dipole: 0.00007 -0.00006 0.00000 0.00001 -0.00000 0.00000 -0.00712 0.00597 -0.00115
magnitude: 0.00115 au
magnitude: 0.00293 debye
