program: Gaussian 09
title: 000065833
version: EM64L-G09RevD.01
frameworkgroup: C1[X(C15H22N2O)]
method: RPBEPBE
basis: SDD
operation: Freq
keyword: #p
keyword: freq=noraman
keyword: PBEPBE/SDD
title: #p freq=noraman PBEPBE/SDD
converged: YES YES NO NO
title: Mulliken charges:
elementType: O N N C C C C C C C C C C C C C C C H H H H H H H H H H H H H H H H H H H H H H
charge: -0.316204 -0.131343 -0.578713 0.047084 -0.141272 -0.637109 -0.430605 0.446238 0.185358 -0.385503 -0.427624 -0.335690 -0.379453 -0.233531 -0.240052 -0.244738 -0.672291 -0.653352 0.265043 0.238269 0.233515 0.207232 0.174522 0.266345 0.222665 0.254422 0.308003 0.257422 0.201291 0.260075 0.211610 0.225518 0.223978 0.227473 0.206299 0.250826 0.216839 0.209278 0.254956 0.213219
chargesum: 0.00000
title: Mulliken charges with hydrogens summed into heavy atoms:
elementType: O N N C C C C C C C C C C C C C C C
charge: -0.316204 -0.131343 -0.016288 0.047084 0.123770 -0.165325 -0.048851 0.446238 0.185358 -0.119159 -0.204958 0.123023 0.092232 -0.008013 -0.016075 -0.017265 0.001673 0.024101
polarizability: 1.97637712e+02 -1.48609822e+01 1.66531505e+02 -4.12035697e+00 -1.07417819e+01 1.58541863e+02
1716.lowfreq: -12.6445 -7.6060 -0.0003 -0.0002 0.0005 5.2392 15.0917 38.9900 45.4066
frequency: 6.7318 38.9110 45.3732 56.6704 70.5980 93.3135 113.7778 127.8246 151.2838 169.7202 187.5525 199.2783 217.0842 231.5796 255.9571 291.0284 312.0195 334.6281 352.5786 377.8981 402.2108 406.5750 434.5166 470.2747 482.0427 519.9993 559.9871 599.0482 616.1293 657.0879 701.6207 709.5278 744.8260 764.0415 773.0402 783.2677 789.8080 830.6369 854.1711 861.5628 898.4568 920.5684 930.2719 940.4150 978.4088 983.5609 990.4659 997.4765 998.9621 1023.5601 1030.2111 1058.6263 1068.6883 1077.9055 1080.7555 1089.3645 1099.2565 1109.1406 1124.9225 1150.8809 1172.2302 1187.7246 1192.6790 1210.1299 1233.6726 1259.8051 1283.6245 1292.8019 1302.5378 1318.5230 1341.6644 1351.6965 1354.9585 1375.0864 1385.1890 1388.1492 1401.1062 1416.4089 1433.7659 1451.8337 1460.3176 1467.2659 1469.6069 1472.4757 1475.9325 1482.5781 1484.9502 1486.0698 1541.6404 1586.3199 1610.4732 1634.6759 2864.4539 2983.9610 2984.5806 2987.1920 3003.2955 3013.8468 3068.6207 3073.5065 3083.7307 3084.5282 3092.6310 3101.4649 3106.3574 3118.0623 3124.8625 3126.0641 3137.6485 3147.3387 3162.5174 3183.7160 3414.1941 3555.0385
redmass: 3.7176 3.6194 3.6978 2.9114 4.3548 2.8155 4.1727 3.4074 2.6403 2.3709 4.1514 1.5596 1.3011 1.9762 2.9106 2.7293 2.8763 1.8240 1.5836 3.7411 2.8294 2.2960 3.0091 3.9558 3.5963 3.2869 3.1545 3.7828 6.3115 4.4598 2.8172 2.7082 1.8188 1.4666 1.4907 1.2408 1.4983 2.0239 1.2911 2.3239 1.8964 1.4523 1.8476 2.0442 1.3817 3.5112 4.7008 1.3504 1.9838 2.6662 1.9258 1.4077 2.0781 2.1882 1.8508 1.6059 1.7777 1.6212 1.7440 1.6738 1.0525 1.7426 1.1603 2.9026 1.8836 2.0503 1.5438 1.3264 1.4102 1.3682 1.2530 1.5210 1.3074 6.6761 1.2196 1.2097 1.6978 2.6694 2.1718 1.1876 1.2825 1.0463 1.0467 1.1015 1.1018 1.0784 2.1009 1.1003 4.2981 5.9967 6.0088 1.1166 1.0710 1.0448 1.0435 1.0521 1.0877 1.0609 1.1006 1.0983 1.0993 1.0569 1.0951 1.1021 1.0994 1.0850 1.0899 1.0872 1.0921 1.0961 1.1015 1.1135 1.0461 1.0957
irintensity: 0.1669 0.7621 0.1621 1.0679 0.9932 0.3017 1.9088 0.8046 0.4037 2.6048 2.7924 0.2276 0.4734 1.0379 1.6565 0.7356 2.7154 38.0758 54.9008 30.9998 0.3261 1.0749 9.8628 4.8457 5.6011 13.6384 13.3314 10.4453 0.2232 3.6603 25.2579 22.0327 41.5046 170.0937 38.0593 7.7409 18.5226 3.7663 0.7204 24.9711 6.7658 7.3159 10.5718 6.4036 0.5485 3.2415 0.5842 0.2791 7.9691 1.9848 13.1110 7.7628 16.7015 7.8702 9.7450 12.6119 13.9035 19.0302 20.2763 23.0302 0.0395 6.9698 0.2529 24.5542 22.0795 2.4984 49.0120 3.0988 35.2166 3.6242 4.7717 9.6743 10.9046 0.9775 14.2001 25.6315 43.5170 84.8364 10.1346 27.1813 15.8849 4.9076 9.5498 10.8952 8.5941 5.5960 26.1350 12.2182 262.8875 0.7574 15.8660 37.5416 106.2754 6.0121 48.9785 43.3925 63.3681 34.3586 8.3793 16.9027 33.7262 16.4762 22.6724 21.3066 36.5351 5.3744 7.1975 3.0532 21.3783 26.5737 25.7140 15.8742 47.6133 11.3191
temp: 298.150 k
press: 1.00000 atm
elementType: 8 7 7 6 6 6 6 6 6 6 6 6 6 6 6 6 6 6 1 1 1 1 1 1 1 1 1 1 1 1 1 1 1 1 1 1 1 1 1 1
symmnumber: 1
zpe: 897735.1 jmol-1
zpe.correction: 0.341929 hartree
zpe.thermalcorrener: 0.360997 hartree
zpe.thermalcorrenthalpy: 0.361941 hartree
zpe.thermalcorrgfe: 0.292699 hartree
zpe.sumelectzpe: -768.121337 hartree
zpe.sumelectthermal: -768.102269 hartree
zpe.sumelectthermalent: -768.101325 hartree
zpe.sumelectthermalfe: -768.170567 hartree
dipole: -0.6208 -3.3707 2.2517
dipole: 4.1009
quadrupole: -101.2174 -108.9353 -105.1210
quadrupole: -1.4210 -1.7900 0.5928
quadrupole: 3.8739 -3.8441 -0.0298 -1.4210 -1.7900 0.5928
hfenergy: -768.4632661 hartree
pointgroup: C01 [X(C15H22N2O1)]
dipole: 0.2278544 -1.390449 -0.7860119 debye
polarizability: 198.1133957|14.0241618|167.6226013|-4.8216836|10.1997918|156.9750832 unknown
InChI: InChI=1S/C15H22N2O/c1-3-17(4-2)14(18)15(10-13(15)11-16)12-8-6-5-7-9-12/h5-9,13H,3-4,10-11,16H2,1-2H3
charge 0 multiplicity 1
40 atoms
O  1.686759 0.755263 1.229003
N  1.581685 -1.263791 0.102368
N  1.442981 3.563943 0.383092
C  0.115534 0.629503 -0.650834
C  0.344227 2.053457 -1.225787
C  0.430556 0.833588 -2.147239
C  1.584758 2.88535 -0.918204
C  -1.293656 0.282139 -0.206941
C  1.188209 0.054437 0.279673
C  -1.6888 0.591034 1.123466
C  -2.236698 -0.33276 -1.068413
C  2.638274 -1.796014 1.002116
C  0.998834 -2.205279 -0.880935
C  -2.990355 0.289733 1.576179
C  -3.544022 -0.629329 -0.617751
C  -3.926112 -0.321088 0.707099
C  4.05679 -1.492945 0.475079
C  0.006913 -3.20906 -0.249639
H  -0.572915 2.650708 -1.287173
H  -0.360221 0.673867 -2.886599
H  1.430959 0.546636 -2.491676
H  1.680293 3.65374 -1.711278
H  2.487803 2.229554 -0.99433
H  -0.967605 1.072528 1.793663
H  -1.952856 -0.588344 -2.096113
H  2.100796 4.33833 0.519629
H  1.480329 2.870671 1.143267
H  2.504814 -1.331728 1.993848
H  2.484497 -2.885617 1.101942
H  0.491048 -1.624976 -1.665563
H  1.831271 -2.754593 -1.364618
H  -3.278761 0.537453 2.604119
H  -4.26022 -1.102371 -1.299511
H  -4.938547 -0.550556 1.058016
H  4.215282 -1.922765 -0.531209
H  4.215341 -0.402529 0.422715
H  4.817789 -1.92042 1.153643
H  0.484401 -3.807164 0.547274
H  -0.859417 -2.680505 0.182206
H  -0.362657 -3.909101 -1.021786
