program: Gaussian 09
title: 000065971
version: EM64L-G09RevD.01
frameworkgroup: C1[X(C25H25ClN2O4S)]
method: RPBEPBE
basis: SDD
operation: Freq
keyword: #p
keyword: freq=noraman
keyword: PBEPBE/SDD
title: #p freq=noraman PBEPBE/SDD
converged: YES YES NO NO
title: Mulliken charges:
elementType: Cl S O O O O N N C C C C C C C C C C C C C C C C C C C C C C C C C H H H H H H H H H H H H H H H H H H H H H H H H H
charge: -0.039100 0.936180 -0.539689 -0.529955 -0.415843 -0.230756 -0.529930 0.000467 -0.539167 0.518191 -0.383664 0.303857 0.240988 -0.469519 -0.408819 -0.414960 -0.322314 -0.376225 -0.414964 -0.414620 0.250110 -0.481793 -0.028733 -0.322876 -0.494902 -0.193512 -0.240424 0.172613 -0.149464 -0.189829 -0.188379 -0.123643 -0.353861 0.210863 0.218257 0.281333 0.232626 0.235249 0.202712 0.234634 0.234198 0.230186 0.225246 0.231929 0.320570 0.254263 0.245109 0.256489 0.251435 0.266463 0.259709 0.288595 0.292495 0.279401 0.268581 0.232170 0.245092 0.376928
chargesum: 0.00000
title: Mulliken charges with hydrogens summed into heavy atoms:
elementType: Cl S O O O O N N C C C C C C C C C C C C C C C C C C C C C C C C C
charge: -0.039100 0.936180 -0.539689 -0.529955 -0.038915 -0.230756 -0.209360 0.000467 -0.110047 0.518191 0.130295 0.303857 0.240988 -0.031558 -0.174185 -0.180762 -0.090386 0.079207 -0.160701 -0.169512 0.250110 0.026131 -0.028733 -0.056413 -0.235193 0.095082 0.052072 0.172613 0.129937 0.078752 0.043791 -0.123643 -0.108768
polarizability: 4.06008563e+02 1.76851856e+01 3.50442486e+02 5.56671621e+01 -1.77648814e+01 2.40163850e+02
1716.lowfreq: -6.4095 -4.9339 -0.0012 -0.0008 0.0006 3.0388 8.9668 11.4258 16.4408
frequency: 8.0522 11.2880 16.4243 18.4691 26.2500 31.2140 32.8455 45.6480 52.5964 62.4691 68.4823 72.1423 82.8917 88.3174 98.9764 118.2804 124.8457 137.3780 152.1596 171.3098 199.8084 212.4327 217.7732 228.0427 240.4862 248.3189 257.3530 264.5605 290.6668 305.5477 326.4017 337.9211 368.4985 369.3242 386.4237 396.5866 406.0450 408.8725 409.7343 428.6000 440.4850 457.1830 477.7719 493.9260 502.1030 513.4092 536.5613 576.3440 588.0579 596.8248 610.7530 616.4973 632.0856 637.9834 650.3378 693.6347 703.1176 709.2793 724.7358 727.3094 742.8250 746.0868 778.4528 796.6924 814.2463 820.4504 826.7184 833.8272 845.7460 852.0096 858.6615 877.1444 892.1230 899.3592 929.2966 931.0038 948.2790 950.6788 954.0923 965.6957 970.6332 977.4740 982.7306 991.5381 1002.5676 1010.1070 1014.9312 1019.5005 1022.9246 1036.9198 1048.0366 1051.5917 1059.7066 1064.2533 1081.6442 1105.4198 1107.4082 1116.0214 1125.3165 1152.8982 1169.8384 1176.5387 1181.6448 1198.9880 1205.3075 1218.7209 1226.7650 1228.6960 1256.0914 1260.3870 1282.6877 1284.7159 1289.9233 1302.2517 1306.6459 1317.5031 1327.0454 1338.7248 1339.6170 1356.5637 1361.4204 1370.9709 1379.2047 1379.4557 1384.2429 1402.5445 1410.6221 1437.9693 1448.8010 1455.6884 1458.3580 1463.6267 1470.8505 1477.1280 1504.5830 1541.1459 1567.8413 1568.3201 1579.4108 1596.7823 1616.3162 1625.9086 1668.3686 2944.0386 2968.0925 2986.4330 2987.6954 2999.9587 3025.6104 3027.4112 3035.0587 3052.7059 3068.0594 3089.2588 3114.2500 3125.8176 3128.0689 3132.4373 3141.9894 3143.5654 3150.3211 3158.8186 3164.3766 3166.8333 3179.6084 3182.8778 3391.2277 3512.8558
redmass: 8.8222 9.7832 11.4275 7.1454 7.4477 5.5279 5.9999 5.8237 5.4279 4.6102 4.0311 3.7868 2.3272 4.0584 4.2373 6.3024 5.3945 4.2021 5.9265 5.5082 3.9615 7.0379 6.0583 4.7348 5.2696 4.5877 6.2509 4.7438 4.0954 4.6759 3.9571 4.0348 3.0763 5.9155 5.1607 3.1155 4.2159 2.9254 3.2081 7.4776 4.1607 4.2058 4.0264 5.0138 1.7869 4.3711 3.4470 4.2396 4.6784 3.5580 7.1157 5.1854 5.3796 1.3241 4.8699 4.5245 3.3645 3.4445 1.8430 1.9686 2.7348 1.6052 3.4959 14.4746 1.5279 1.4031 1.5774 1.3783 1.6036 1.2861 4.5793 1.9418 1.5324 3.9595 1.3372 5.1645 1.5568 2.3315 1.3708 1.4833 1.3783 1.3843 6.7232 1.3846 3.8871 3.4607 2.9924 2.6013 2.6431 2.1964 3.1559 2.7813 2.9229 3.2739 2.3382 2.2197 1.3221 1.7043 1.4164 1.3561 2.2346 1.1282 1.1664 1.1383 1.3796 2.0083 1.2483 1.3584 1.4870 1.4346 1.2322 1.6611 1.1752 6.9383 1.3922 1.4210 1.3884 1.2252 1.3646 1.8066 1.2771 1.8602 3.2997 3.2498 6.4747 2.1360 2.8647 1.0860 2.0786 1.1082 2.2005 1.1067 1.0732 1.0933 2.6409 5.1537 6.3274 6.3071 5.7805 8.2043 6.5889 7.5674 8.2452 1.0658 1.0584 1.0621 1.0611 1.0607 1.0920 1.1034 1.0979 1.0999 1.1030 1.0885 1.0879 1.0874 1.0893 1.0895 1.0949 1.0923 1.0967 1.0897 1.0895 1.1002 1.0965 1.0978 1.0756 1.0640
irintensity: 0.4489 0.1536 1.2347 0.1266 0.2082 0.1717 0.7580 1.5442 0.9712 0.2320 0.3159 0.8482 0.4689 1.1795 1.8272 4.0435 1.9391 0.4128 2.9444 1.2069 0.9834 1.9553 1.5431 3.5389 2.2907 1.6674 3.7119 0.9691 15.5777 5.8431 2.6186 4.0088 5.3337 24.1286 37.8008 2.8760 0.6688 0.2715 1.1001 23.0421 0.2057 7.3426 21.4888 21.9203 29.3486 94.8804 5.6064 6.1997 4.4745 21.5944 0.3647 7.1476 4.1384 125.2379 3.3088 5.5343 6.5910 32.6803 57.8178 24.6467 1.6277 29.6866 39.7521 125.7829 14.7222 46.3274 20.9259 39.1819 12.7454 3.2383 1.1730 8.8593 12.3739 8.4470 5.5418 71.5633 5.0594 5.4575 2.6103 0.7391 0.4142 0.0962 28.9013 0.5856 11.9429 144.6205 54.6213 33.5069 8.4473 6.4397 19.5922 18.4168 65.6739 37.4051 64.1854 7.6665 5.1262 7.8010 5.0078 0.6069 4.3593 5.1871 12.1425 0.3649 2.8637 1.7440 6.2889 8.2824 2.8166 7.5397 3.1308 13.9012 9.4854 2.8343 1.1322 0.5879 19.2925 2.4925 14.1755 6.0648 2.8220 45.6160 28.7804 3.1524 0.2425 16.3882 7.2797 23.9788 45.5636 2.0122 16.4300 12.8593 15.2131 12.8329 27.2917 7.1616 14.5433 6.7123 0.8046 2.1924 0.5139 2.1403 191.1981 19.4095 25.4014 61.7634 8.1588 17.3741 8.7888 36.0507 0.6055 17.0000 33.4943 39.6279 13.1177 9.5627 20.9629 1.8543 28.4367 11.5084 3.8672 2.7064 1.0882 23.1867 0.4939 2.2580 18.2661 21.7831
temp: 298.150 k
press: 1.00000 atm
elementType: 17 16 8 8 8 8 7 7 6 6 6 6 6 6 6 6 6 6 6 6 6 6 6 6 6 6 6 6 6 6 6 6 6 1 1 1 1 1 1 1 1 1 1 1 1 1 1 1 1 1 1 1 1 1 1 1 1 1
symmnumber: 1
zpe: 1167151.2 jmol-1
zpe.correction: 0.444544 hartree
zpe.thermalcorrener: 0.477191 hartree
zpe.thermalcorrenthalpy: 0.478135 hartree
zpe.thermalcorrgfe: 0.373209 hartree
zpe.sumelectzpe: -2233.613821 hartree
zpe.sumelectthermal: -2233.581175 hartree
zpe.sumelectthermalent: -2233.580230 hartree
zpe.sumelectthermalfe: -2233.685157 hartree
dipole: -1.3721 1.5122 3.9101
dipole: 4.4111
quadrupole: -222.7295 -193.3711 -219.1558
quadrupole: 12.7922 17.7705 8.8365
quadrupole: -10.9774 18.3811 -7.4037 12.7922 17.7705 8.8365
hfenergy: -2234.0583654 hartree
pointgroup: C01 [X(C25H25Cl1N2O4S1)]
dipole: -0.6312742 0.4628072 1.5489168 debye
polarizability: 399.0335619|22.5456669|356.7647819|60.00287|-5.7937103|240.8165548 unknown
InChI: InChI=1S/C25H25ClN2O4S/c26-22-11-13-23(14-12-22)33(31,32)28-17-15-19-7-9-20(10-8-19)24(5-1-2-6-25(29)30)21-4-3-16-27-18-21/h3-5,7-14,16,18,28-29H,1-2,6,15,17H2
charge 0 multiplicity 1
58 atoms
Cl -0.264183 -3.686631 -1.532598
S  5.193093 -0.399938 -0.508255
O  6.399686 -1.491592 -0.397517
O  5.203262 0.845156 -1.563363
O  -6.833269 -4.154314 0.463801
O  -5.10576 -3.995168 2.006565
N  4.985263 0.30803 1.218609
N  -3.817309 3.079864 -2.287054
C  3.79014 2.277853 2.19643
C  2.410484 1.963243 1.643008
C  4.952234 1.792824 1.284095
C  -0.19007 1.356839 0.563596
C  -1.524684 1.01322 -0.027978
C  -3.255195 -0.864644 -0.545043
C  1.85605 2.735154 0.588483
C  1.636724 0.892165 2.155688
C  -1.922793 -0.299993 -0.104821
C  -3.766004 -1.939894 0.449313
C  0.581762 2.442263 0.060129
C  0.360857 0.597525 1.632847
C  -2.376206 2.139328 -0.519433
C  -5.093375 -2.563369 -0.020489
C  3.596553 -1.350936 -0.797983
C  -2.577255 3.314707 0.255824
C  -3.012599 2.095354 -1.792418
C  2.496311 -0.658767 -1.326324
C  3.586511 -2.72205 -0.49623
C  -5.623718 -3.615028 0.934095
C  1.305831 -1.382331 -1.556619
C  2.394088 -3.443832 -0.728385
C  -3.404438 4.344525 -0.238321
C  1.277146 -2.756846 -1.246636
C  -4.011232 4.183864 -1.506215
H  3.914776 3.37322 2.31366
H  3.912835 1.82822 3.198647
H  4.819139 2.185161 0.256254
H  5.915726 2.195161 1.655396
H  -4.009009 -0.063065 -0.656782
H  -3.14803 -1.339612 -1.544899
H  2.427304 3.577073 0.176662
H  2.037947 0.28793 2.97738
H  -3.899894 -1.49117 1.450915
H  -3.005429 -2.735637 0.563722
H  -1.202095 -1.062743 0.226502
H  5.763766 -0.130148 1.744077
H  0.182801 3.053798 -0.757026
H  -0.227731 -0.21481 2.073668
H  -5.877981 -1.791105 -0.143879
H  -4.982405 -3.034618 -1.017157
H  -2.094231 3.408065 1.234417
H  -2.85146 1.238063 -2.456453
H  2.560506 0.407607 -1.561736
H  4.486413 -3.214983 -0.115451
H  0.423123 -0.879641 -1.959794
H  2.338964 -4.513912 -0.51167
H  -3.581567 5.253991 0.344506
H  -4.668016 4.956156 -1.922346
H  -7.157656 -4.840077 1.109087
