program: Gaussian 09
title: 000065831
version: EM64L-G09RevD.01
frameworkgroup: C1[X(C19H29NO4)]
method: RPBEPBE
basis: SDD
operation: Freq
keyword: #p
keyword: freq=noraman
keyword: PBEPBE/SDD
title: #p freq=noraman PBEPBE/SDD
converged: YES YES NO NO
title: Mulliken charges:
elementType: O O O O N C C C C C C C C C C C C C C C C C C C H H H H H H H H H H H H H H H H H H H H H H H H H H H H H
charge: -0.230175 -0.284104 -0.298902 -0.267222 -0.084088 -0.016784 -0.389677 -0.425105 -0.405603 -0.354178 -0.352757 -0.745242 -0.442928 -0.481408 0.133037 0.054145 0.267071 0.240527 -0.544297 -0.542898 0.377966 -0.534169 -0.523028 -0.534201 0.199237 0.165326 0.220702 0.186672 0.208109 0.202991 0.189878 0.208701 0.167184 0.198158 0.189654 0.215393 0.213131 0.209523 0.225105 0.224200 0.234815 0.306403 0.264721 0.264045 0.224975 0.244247 0.227044 0.270227 0.225715 0.203001 0.225786 0.223663 0.245415
chargesum: 0.00000
title: Mulliken charges with hydrogens summed into heavy atoms:
elementType: O O O O N C C C C C C C C C C C C C C C C C C C
charge: -0.230175 -0.284104 -0.298902 -0.267222 -0.084088 0.182453 -0.003649 -0.030324 -0.012734 0.021708 0.035055 -0.107195 0.006377 0.059810 0.133037 0.054145 0.267071 0.240527 -0.279576 -0.278853 0.377966 0.162097 0.175915 0.160663
polarizability: 2.89172388e+02 1.06676712e+00 2.41753275e+02 9.47231425e+00 4.02218355e+00 1.69002126e+02
1716.lowfreq: -0.9862 -0.0006 -0.0004 0.0006 2.2678 8.7295 12.4851 23.1478 28.6315
frequency: 12.0828 22.7708 28.1433 34.6217 46.6598 76.3133 82.6090 97.3168 101.1688 124.7919 139.5255 150.1785 161.3127 164.6517 174.0956 187.0017 195.8051 202.3886 207.2402 222.1379 229.9430 245.0514 268.2213 269.3387 279.2539 286.3311 301.5020 332.5605 357.9509 378.0835 407.4534 422.1571 423.2406 429.9055 438.1402 492.3779 502.8473 511.8143 545.5547 549.3127 582.4744 620.7910 637.0181 654.2714 738.2026 755.5483 775.7808 787.4920 826.1685 827.9853 850.3351 853.2286 866.2808 880.4014 889.2093 894.2060 900.7141 934.8020 969.6598 972.2414 983.9222 991.3593 1002.2999 1027.8968 1036.6718 1064.0316 1077.6347 1087.7771 1097.1747 1112.8831 1113.5347 1113.6247 1117.1998 1123.1990 1132.9664 1143.1971 1152.8856 1156.0344 1159.0121 1162.9005 1168.3029 1185.1600 1205.8713 1206.8048 1233.4070 1247.3533 1267.6008 1268.9087 1287.6833 1288.9839 1290.9191 1309.1761 1318.0878 1337.0066 1343.9106 1346.5698 1359.8645 1369.5454 1374.1156 1387.0726 1391.0424 1402.4682 1425.4104 1439.7078 1441.0317 1445.0324 1451.5591 1456.7014 1460.4644 1461.4024 1464.3016 1466.1531 1466.6080 1470.8983 1474.2809 1474.9555 1476.1548 1478.3607 1478.8069 1482.6653 1483.4318 1570.8700 1588.9683 1608.4018 2806.9943 2817.5232 2842.1221 2954.4756 2960.4459 2963.5381 2964.1571 2964.2222 2965.4630 2966.8821 2983.5700 2996.4203 3007.9011 3018.6216 3024.1811 3034.6202 3038.5186 3047.5695 3053.9724 3055.3414 3061.0068 3061.7545 3065.0700 3067.8334 3120.2819 3121.8976 3127.1378 3178.7301 3183.6302
redmass: 4.2265 4.4568 3.9061 3.8686 4.9422 3.2265 3.7217 3.4311 2.9327 3.6922 3.3354 3.0136 2.4361 1.1403 2.8214 2.4619 2.1019 1.5891 1.1741 2.4159 2.1127 3.4890 1.9261 1.8540 2.9965 3.5692 3.1411 2.6053 5.0477 2.1412 3.4374 4.1868 3.9403 4.5335 1.9222 5.7164 3.1315 5.2656 2.0744 3.7048 5.6537 3.6946 3.2225 3.2760 1.9130 2.6193 3.4167 2.3816 1.9906 1.8233 2.0073 1.6432 5.1516 2.1253 2.1460 2.9332 2.1341 1.9367 1.6360 7.0025 2.3034 1.6206 2.9314 3.0446 2.1521 3.4833 2.4225 2.1515 2.4447 1.2601 1.2575 1.2686 1.9584 2.5096 1.9858 1.5934 1.3513 1.3733 1.4054 1.6191 2.1417 1.9153 1.6794 1.8251 1.4392 1.4394 1.2155 1.2192 3.4776 1.6896 1.3772 1.5504 1.2876 1.4109 1.5209 1.4555 1.6505 6.0715 1.4592 1.3242 1.3298 2.5179 1.2834 1.1082 1.2890 1.3755 1.0886 1.0889 1.1554 1.5954 1.0962 1.0502 1.0533 1.0821 1.0679 1.0811 1.0541 1.2459 1.1182 1.0950 1.0619 8.5441 7.9032 7.3082 1.0709 1.0702 1.0701 1.0667 1.0333 1.0653 1.0357 1.0365 1.0697 1.0371 1.0621 1.0853 1.0646 1.0904 1.0937 1.0892 1.0879 1.1034 1.1041 1.1043 1.0993 1.0996 1.0991 1.1002 1.1031 1.1003 1.1000 1.0912 1.0911
irintensity: 0.0160 0.2077 0.9637 0.4019 1.3854 8.1123 1.9745 2.8500 4.1250 1.2821 3.6735 4.3342 0.5538 0.6845 4.2231 0.3189 0.2053 2.4810 0.5835 11.6219 1.7485 2.2157 4.9617 1.7879 2.1313 0.5558 1.7942 1.2198 7.2139 4.6547 1.3685 1.4631 0.7122 11.8274 0.4086 2.8685 4.0056 0.2224 6.7059 5.5640 31.1384 7.8537 6.4225 2.0820 12.3414 9.8228 8.2453 7.1225 0.6348 3.0332 29.0977 13.7940 20.1477 10.9202 6.7157 16.7702 3.9811 5.6043 14.9423 31.2775 10.5549 1.3976 15.2014 46.3099 14.7733 182.8897 47.3507 11.7324 12.8424 0.2572 12.6615 0.2700 20.6779 33.8111 184.0637 12.2559 5.4378 5.5659 18.7500 68.2216 7.1783 28.8672 24.6313 45.9276 20.8234 53.6143 10.7041 6.9490 6.8455 71.6326 2.7233 71.5731 4.7178 4.1780 4.7092 2.8816 47.4680 70.0623 6.2664 10.7973 6.3709 43.2164 14.0605 25.8045 23.0361 29.9980 8.9648 11.6286 2.6807 32.0449 0.7580 12.4067 11.4652 4.8645 32.5754 24.9365 7.4127 23.3845 0.7248 13.7119 13.9667 74.3283 319.9355 341.0705 50.3736 93.8796 233.7596 10.6594 82.6666 48.5741 51.4754 60.6704 47.0172 59.4420 29.3577 15.5798 26.1310 49.2327 72.6339 22.8391 5.2225 62.1286 38.7382 38.7176 55.6939 65.0136 42.1877 22.0793 23.9366 21.4511 23.8494 3.3252 1.4172
temp: 298.150 k
press: 1.00000 atm
elementType: 8 8 8 8 7 6 6 6 6 6 6 6 6 6 6 6 6 6 6 6 6 6 6 6 1 1 1 1 1 1 1 1 1 1 1 1 1 1 1 1 1 1 1 1 1 1 1 1 1 1 1 1 1
symmnumber: 1
zpe: 1177034.3 jmol-1
zpe.correction: 0.448309 hartree
zpe.thermalcorrener: 0.474502 hartree
zpe.thermalcorrenthalpy: 0.475446 hartree
zpe.thermalcorrgfe: 0.390186 hartree
zpe.sumelectzpe: -1095.136494 hartree
zpe.sumelectthermal: -1095.110301 hartree
zpe.sumelectthermalent: -1095.109357 hartree
zpe.sumelectthermalfe: -1095.194617 hartree
dipole: -0.9410 -3.0284 -0.7335
dipole: 3.2549
quadrupole: -114.1834 -141.9097 -148.0215
quadrupole: 1.5971 -0.2276 -2.5580
quadrupole: 20.5215 -7.2049 -13.3166 1.5971 -0.2276 -2.5580
hfenergy: -1095.5848025 hartree
pointgroup: C01 [X(C19H29N1O4)]
dipole: 0.4715576 -1.0581697 0.5457118 debye
polarizability: 288.8771703|5.4062342|236.7847061|9.5022815|-18.9268292|174.2659128 unknown
InChI: InChI=1S/C19H29NO4/c1-14-7-5-9-20(13-14)10-6-8-16(21)19-17(23-3)11-15(22-2)12-18(19)24-4/h11-12,14H,5-10,13H2,1-4H3
charge 0 multiplicity 1
53 atoms
O  0.557649 2.211222 -1.796707
O  0.341616 -1.281822 -0.258648
O  3.077872 2.721402 -0.239536
O  5.015291 -1.622863 0.961251
N  -3.59262 0.695587 0.618137
C  -4.227955 -1.502807 -0.408809
C  -3.990797 0.00904 -0.634824
C  -5.288962 -1.705991 0.6998
C  -4.896203 -0.938874 1.98165
C  -4.631427 0.547052 1.667313
C  -3.212646 2.117807 0.413893
C  -4.626769 -2.202126 -1.724534
C  -1.930666 2.305468 -0.426633
C  -0.738915 1.524065 0.151905
C  0.494461 1.522388 -0.736954
C  1.684093 0.704374 -0.285311
C  1.599859 -0.701064 -0.032296
C  2.950599 1.319249 -0.111402
C  2.723835 -1.447788 0.370719
C  4.092092 0.593544 0.305323
C  3.967117 -0.791712 0.543662
C  0.191766 -2.719339 -0.021147
C  3.503009 3.196117 -1.576483
C  6.330409 -1.005573 1.157242
H  -3.267939 -1.928781 -0.046319
H  -4.927656 0.46071 -1.063715
H  -3.191152 0.142587 -1.385092
H  -6.268345 -1.333339 0.330151
H  -5.416405 -2.785097 0.91457
H  -3.976601 -1.380427 2.412731
H  -5.696047 -1.017297 2.743421
H  -4.282432 1.071869 2.576764
H  -5.596382 1.03073 1.353542
H  -3.050635 2.556648 1.418867
H  -4.04575 2.69905 -0.061558
H  -3.85005 -2.075225 -2.502178
H  -4.777042 -3.286853 -1.568177
H  -5.573326 -1.787172 -2.122126
H  -1.695914 3.38558 -0.473369
H  -2.094919 1.997201 -1.475445
H  -0.433193 1.940906 1.135948
H  -1.036027 0.480136 0.363159
H  2.679906 -2.523457 0.554059
H  5.024087 1.140912 0.464368
H  0.410892 -2.977986 1.03259
H  -0.863383 -2.934641 -0.246472
H  0.846551 -3.305894 -0.693737
H  2.718956 2.961497 -2.317441
H  3.624246 4.285318 -1.472937
H  4.467992 2.734204 -1.866188
H  6.296227 -0.232226 1.948528
H  6.707555 -0.559119 0.217012
H  6.989774 -1.828492 1.469432
