program: Gaussian 09
title: 000065896
version: EM64L-G09RevD.01
frameworkgroup: C1[X(C20H30ClN3O4)]
method: RPBEPBE
basis: SDD
operation: Freq
keyword: #p
keyword: freq=noraman
keyword: PBEPBE/SDD
title: #p freq=noraman PBEPBE/SDD
converged: YES YES NO NO
title: Mulliken charges:
elementType: Cl O O O O N N N C C C C C C C C C C C C C C C C C C C C H H H H H H H H H H H H H H H H H H H H H H H H H H H H H H
charge: -0.074882 -0.281007 -0.258555 -0.308962 -0.341328 -0.069337 -0.437739 -0.685125 -0.053406 -0.431721 -0.467912 -0.393014 -0.392603 -0.336482 0.006981 0.159224 -0.306434 -0.314536 0.064699 0.333868 -0.359936 -0.544182 -0.384343 0.680222 -0.273904 -0.395944 -0.345207 -0.691882 0.266616 0.208465 0.247195 0.201582 0.221815 0.196026 0.210349 0.219776 0.164075 0.207079 0.214346 0.229972 0.366247 0.230468 0.212232 0.205298 0.229885 0.302964 0.243348 0.219617 0.204506 0.207712 0.197404 0.196224 0.217447 0.309314 0.323413 0.219914 0.222965 0.207189
chargesum: 0.00000
title: Mulliken charges with hydrogens summed into heavy atoms:
elementType: Cl O O O O N N N C C C C C C C C C C C C C C C C C C C C
charge: -0.074882 -0.281007 -0.258555 -0.308962 -0.341328 -0.069337 -0.071491 -0.052398 0.213209 0.023940 -0.044515 0.013361 -0.008751 0.084943 0.236954 0.159224 0.136265 0.120647 0.064699 0.333868 -0.056971 -0.300834 -0.384343 0.680222 0.150220 0.009172 0.068464 -0.041814
polarizability: 3.64293308e+02 2.27763552e+01 2.52912601e+02 3.24439573e+01 -2.19818257e+01 2.04667795e+02
1716.lowfreq: -6.6465 -5.0779 -4.2372 -0.0011 -0.0006 0.0005 9.4344 15.2469 22.6947
frequency: 8.8089 14.9156 22.6110 26.5325 38.6265 42.8782 44.9432 57.3061 60.0315 75.6905 82.0733 87.8345 111.7273 132.6909 139.4099 160.7593 171.9741 212.5167 218.0419 224.6974 233.9527 242.0638 247.4279 263.9955 266.5697 283.4105 299.2132 331.3178 338.1251 344.0627 353.1818 364.9722 390.2778 397.1147 413.5893 427.9507 446.0697 447.2862 481.8462 489.9887 512.2474 539.6657 592.2038 595.4300 610.2411 631.0584 661.6683 665.9519 668.3526 679.4804 699.0463 718.4606 745.5167 747.3535 759.4125 761.1686 800.5528 815.8791 826.7117 841.0616 842.4696 857.5299 875.7144 890.1723 903.7667 926.6790 930.8256 940.6992 964.4488 967.1788 967.6103 986.1346 997.2083 1005.6472 1009.9496 1032.9569 1034.1048 1047.6872 1055.5746 1073.9020 1087.7479 1101.3925 1102.6479 1114.4182 1118.6079 1123.4139 1137.4995 1138.4053 1151.5276 1159.0247 1170.3171 1188.2520 1194.4324 1195.9736 1217.2815 1235.7768 1241.5535 1243.7876 1251.6518 1262.7855 1284.2584 1289.2018 1294.3324 1304.5233 1306.8956 1309.2831 1317.1286 1324.8586 1331.8920 1333.6476 1344.5339 1348.6389 1360.5092 1362.8360 1363.5037 1376.9227 1388.1935 1390.8232 1392.8188 1426.8436 1445.7330 1447.5547 1451.4084 1457.7590 1466.4633 1468.4264 1472.9256 1473.3342 1476.1551 1476.9793 1478.2639 1486.0655 1497.4874 1514.6955 1548.5142 1586.7612 1617.1751 1640.9224 2790.2730 2842.4051 2892.0811 2956.4073 2972.2414 2975.0542 2980.0111 2980.4274 2990.3669 2991.0915 3000.6193 3010.2170 3016.9962 3017.3055 3023.8121 3025.3904 3030.9156 3043.4327 3045.9602 3059.5264 3070.5072 3075.7863 3076.4355 3092.4478 3101.3300 3156.4152 3158.8532 3460.7833 3548.9759 3698.3344
redmass: 5.1535 5.0174 3.6952 4.8288 4.6216 4.6662 3.5359 4.8667 1.9347 4.4752 4.0985 4.6179 4.1068 4.2198 4.5829 5.6172 4.4825 3.6760 1.4203 3.4073 3.1252 2.9549 2.5484 2.6305 2.5767 4.4411 5.0187 2.9052 3.1929 3.6278 2.2438 5.1507 1.6705 1.9831 3.1652 3.2012 2.5254 2.9275 3.2775 1.2479 3.3611 3.5058 4.6467 5.1898 2.3347 5.3179 3.9580 1.3450 6.1318 2.5553 2.6799 2.3307 2.0644 2.8307 3.5888 3.5676 1.7182 3.0977 2.2919 2.1155 1.7114 2.3571 3.4419 4.9505 2.4646 2.6435 2.3621 1.3637 2.4245 1.3290 2.2674 3.0115 2.5391 2.8119 1.7058 3.1771 2.7481 1.9100 1.9521 2.1377 2.2453 3.1880 1.5595 2.1643 2.6852 2.0304 1.9109 2.4103 2.4444 1.1502 2.0841 1.1584 1.3773 1.2670 1.2704 1.9759 1.2348 1.2888 1.3593 1.3843 1.6947 1.1157 1.4042 1.7424 1.2821 1.3536 2.3260 1.2448 1.3632 1.4003 1.4891 1.4114 1.4419 1.4005 1.5822 1.4258 1.2198 3.4710 1.4655 5.0264 1.0911 1.0936 1.0856 1.0875 1.1000 1.0900 1.0969 1.0741 1.0695 1.1010 1.1120 1.0859 2.2577 2.9811 6.5057 6.0944 1.8137 2.3224 1.0701 1.0710 1.0688 1.0553 1.0429 1.0549 1.0688 1.0623 1.0628 1.0633 1.0652 1.0867 1.0994 1.0832 1.0857 1.1033 1.0873 1.1023 1.0908 1.1007 1.1012 1.1011 1.0990 1.0976 1.1032 1.0909 1.0907 1.0796 1.0458 1.1033
irintensity: 0.4098 0.3950 1.1220 1.9127 0.3448 9.0735 0.5035 2.7652 0.7471 2.9275 0.3362 2.3287 0.4483 0.0444 1.1837 0.4096 1.5210 3.9007 0.7012 1.5327 8.8885 0.4394 0.0659 1.1756 2.2930 2.5347 7.5901 2.0373 22.1540 24.5276 4.2293 4.2962 56.4376 31.7302 1.9507 8.0464 55.2017 16.9432 6.0595 110.7153 0.4184 4.6375 14.3808 4.2935 3.6538 23.8443 55.9404 63.9520 12.5940 4.5871 0.5719 9.3116 3.8586 8.3484 4.6683 35.0065 3.7144 6.5803 32.3951 17.1098 22.3333 2.8100 2.1111 10.9364 1.1996 43.5861 38.4233 13.5274 11.7078 5.8101 4.4533 18.5631 83.2677 2.5522 0.0909 8.3888 94.1537 2.6517 3.4826 10.2400 100.1225 65.3020 6.6306 130.1265 51.2174 4.4271 4.4862 0.8176 16.2684 1.3910 79.8827 5.3054 5.6814 18.5631 1.4287 168.1724 2.7069 48.9170 41.0421 8.6750 19.1710 0.8534 49.0959 27.4995 4.4876 20.8753 58.7691 3.5256 9.4573 12.5625 16.1536 1.7877 13.1718 6.5577 6.1849 2.2331 9.6064 28.8193 3.5969 21.3763 19.5932 16.9373 14.5280 21.8862 23.7985 5.3862 1.3924 2.9215 10.0339 10.0930 49.4950 18.1759 512.4035 62.9503 37.8413 220.7524 25.6972 455.9524 195.1282 97.0091 68.0124 32.0539 23.5659 14.8776 56.2177 54.9997 86.6552 15.8568 13.0472 37.0370 13.7831 32.1745 55.6254 37.1020 44.1601 23.0653 47.8661 52.3129 95.8641 24.9299 40.2180 30.3841 34.0507 2.8284 18.6657 95.5164 120.5869 34.2041
temp: 298.150 k
press: 1.00000 atm
elementType: 17 8 8 8 8 7 7 7 6 6 6 6 6 6 6 6 6 6 6 6 6 6 6 6 6 6 6 6 1 1 1 1 1 1 1 1 1 1 1 1 1 1 1 1 1 1 1 1 1 1 1 1 1 1 1 1 1 1
symmnumber: 1
zpe: 1265394.1 jmol-1
zpe.correction: 0.481963 hartree
zpe.thermalcorrener: 0.511069 hartree
zpe.thermalcorrenthalpy: 0.512013 hartree
zpe.thermalcorrgfe: 0.417198 hartree
zpe.sumelectzpe: -1703.158788 hartree
zpe.sumelectthermal: -1703.129682 hartree
zpe.sumelectthermalent: -1703.128738 hartree
zpe.sumelectthermalfe: -1703.223553 hartree
dipole: 1.0966 7.7327 -4.3462
dipole: 8.9380
quadrupole: -144.8957 -169.9283 -177.7982
quadrupole: -17.3479 10.9247 -1.2981
quadrupole: 19.3117 -5.7209 -13.5908 -17.3479 10.9247 -1.2981
hfenergy: -1703.6407513 hartree
pointgroup: C01 [X(C20H30Cl1N3O4)]
dipole: 0.526732 3.465285 0.2826952 debye
polarizability: 362.721721|-2.4396497|258.3329648|43.0343037|12.7553728|200.8190185 unknown
InChI: InChI=1S/C20H30ClN3O4/c1-2-3-8-26-18-12-17(22)16(21)11-15(18)20(25)23-14-4-6-24(7-5-14)13-19-27-9-10-28-19/h11-12,14,19,23H,2-10,13,22H2,1H3
charge 0 multiplicity 1
58 atoms
Cl -6.661799 -1.326286 -2.037917
O  5.758351 0.132899 -2.568284
O  6.16609 -0.90702 -0.468327
O  -1.982423 -2.885311 -0.140662
O  -1.767199 1.36025 0.27719
N  2.981676 -0.804174 -0.2521
N  -0.631523 -1.092544 0.446887
N  -6.2885 1.66566 -1.622721
C  0.49192 -1.968418 0.84396
C  1.222433 -2.566225 -0.389064
C  1.501228 -1.182184 1.711398
C  2.01865 -1.492879 -1.150713
C  2.305093 -0.151672 0.888416
C  3.910341 0.083246 -0.982478
C  5.130795 -0.68498 -1.507952
C  -1.816073 -1.622345 -0.020696
C  7.218514 0.072875 -2.336162
C  7.303521 -0.019205 -0.803026
C  -2.918649 -0.664541 -0.398123
C  -2.920299 0.759994 -0.270572
C  -4.083678 -1.264704 -0.941538
C  -4.031388 1.531397 -0.674409
C  -5.179072 -0.501845 -1.337806
C  -5.193657 0.917357 -1.221662
C  -1.74369 2.824939 0.478047
C  -0.428205 3.176028 1.177662
C  -0.323469 2.630704 2.620397
C  1.027073 2.974688 3.283215
H  0.059765 -2.805215 1.424144
H  1.919597 -3.349525 -0.035054
H  0.479675 -3.043411 -1.051642
H  0.980899 -0.674614 2.547064
H  2.215151 -1.905357 2.146342
H  1.310772 -0.757458 -1.61588
H  2.579618 -1.964763 -1.97846
H  3.075153 0.310233 1.533506
H  1.623989 0.677607 0.547448
H  3.422682 0.587503 -1.851878
H  4.279772 0.875661 -0.306433
H  4.864226 -1.690271 -1.886514
H  -0.56189 -0.07241 0.528032
H  7.653301 0.989228 -2.765095
H  7.651632 -0.82493 -2.819757
H  7.178804 0.976418 -0.331891
H  8.216943 -0.506408 -0.427012
H  -4.07575 -2.356119 -1.028712
H  -4.021779 2.620631 -0.578367
H  -1.819546 3.322844 -0.509872
H  -2.612775 3.118401 1.102336
H  0.41684 2.799488 0.567365
H  -0.339573 4.281627 1.192195
H  -1.154165 3.045858 3.226646
H  -0.465969 1.533266 2.607945
H  -6.293212 2.677231 -1.538088
H  -7.103152 1.194474 -2.010337
H  1.869005 2.533269 2.717132
H  1.0766 2.587523 4.316918
H  1.186827 4.068817 3.324661
