program: Gaussian 09
title: 000065829
version: EM64L-G09RevD.01
frameworkgroup: C1[X(C17H23NO3)]
method: RPBEPBE
basis: SDD
operation: Freq
keyword: #p
keyword: freq=noraman
keyword: PBEPBE/SDD
title: #p freq=noraman PBEPBE/SDD
converged: NO YES NO NO
title: Mulliken charges:
elementType: O O O N C C C C C C C C C C C C C C C C C H H H H H H H H H H H H H H H H H H H H H H H
charge: -0.217269 -0.413391 -0.230476 -0.575430 0.041474 -0.132056 -0.428952 -0.464994 -0.466555 -0.466649 -0.464801 0.063364 0.307996 -0.363120 -0.362932 0.492745 -0.430107 -0.410580 -0.566284 -0.485587 0.189126 0.189614 0.210104 0.174626 0.245203 0.199511 0.187847 0.218938 0.219775 0.206035 0.231749 0.202385 0.191434 0.274733 0.258714 0.235613 0.278230 0.236819 0.238229 0.235743 0.235595 0.268592 0.266805 0.378186
chargesum: 0.00000
title: Mulliken charges with hydrogens summed into heavy atoms:
elementType: O O O N C C C C C C C C C C C C C C C C C
charge: -0.217269 -0.035205 -0.230476 -0.041983 0.231088 0.078048 -0.009123 -0.077636 -0.027841 -0.028865 -0.070983 0.063364 0.307996 -0.127508 -0.084702 0.492745 -0.193288 -0.172351 -0.094946 0.049810 0.189126
polarizability: 2.86229269e+02 4.84416415e+00 1.74824112e+02 -5.33968339e+00 -1.20250855e+01 1.48020311e+02
1716.lowfreq: -13.0837 -10.1393 -0.0006 -0.0003 0.0004 1.7621 10.4224 17.2219 17.4368
frequency: -6.0500 9.3000 17.2925 36.8165 46.9794 59.2512 69.1576 94.3281 106.1945 127.2533 160.0045 175.6237 190.0905 220.3457 226.0797 243.8257 248.8147 295.4846 320.2851 346.3466 396.2577 403.2281 404.7620 424.4796 443.4865 459.5532 488.3528 503.5892 528.5176 536.3128 565.1698 625.8551 633.4972 638.2038 638.8738 683.1319 752.4863 772.7616 778.0834 788.9130 793.5073 825.1888 840.0329 852.7736 862.6218 892.9346 900.3107 919.2593 931.5295 971.7814 983.7415 989.4505 1002.4092 1002.9424 1011.7857 1020.5638 1036.5013 1046.0034 1059.4805 1066.4719 1077.4902 1104.7870 1108.3078 1115.8812 1144.9520 1152.5965 1165.0916 1190.9463 1207.0320 1215.1460 1223.8176 1239.9284 1247.5290 1258.1690 1264.8274 1267.4868 1283.6832 1298.0010 1301.0616 1307.5582 1313.9375 1315.2670 1326.5060 1343.2599 1357.5332 1365.3655 1366.5335 1377.9980 1381.1584 1410.1074 1439.7530 1461.9913 1464.9777 1470.4046 1474.2854 1475.5599 1480.3327 1499.8764 1554.4780 1588.4362 1619.5808 1639.0301 1666.9164 2867.3655 2928.2170 2949.7745 2957.0220 2973.3872 2980.3624 2991.6166 3000.6216 3003.7017 3012.3084 3017.4884 3037.5678 3046.0967 3049.2642 3054.9122 3075.1415 3120.2675 3122.8280 3153.6032 3158.6331 3450.6913 3512.6806 3577.4017
redmass: 4.1577 4.9783 8.3495 3.8002 7.2629 3.2188 2.3066 4.0185 3.3699 5.2846 5.2944 3.6616 2.7188 2.4887 1.3799 3.4707 2.1357 5.3192 2.7086 3.3590 3.6456 2.0386 2.8438 4.6073 2.7165 3.5391 3.8912 1.7713 3.0929 2.1135 4.8025 1.3360 6.5652 3.4868 1.4674 4.0580 3.8085 2.7669 1.3821 2.3444 2.0058 3.5932 1.9858 2.2446 1.4186 2.1086 1.7621 1.4422 2.3546 1.3909 2.0703 2.7083 1.7224 1.4898 2.6966 3.4481 1.8526 2.0336 1.1111 2.2458 2.4568 2.6206 2.4288 1.4317 2.1901 1.1818 1.8128 1.1867 1.5099 1.9107 1.9229 1.4348 1.4160 1.4600 1.2930 1.1811 1.2584 1.4274 1.7616 1.2960 1.2549 1.3229 1.3607 1.4841 1.6754 1.5921 1.7998 1.4259 4.7242 3.2676 1.0829 1.0873 1.0869 1.0852 1.0990 1.0873 1.0890 2.5762 7.8301 7.6496 6.5170 1.0937 8.2838 1.0705 1.0802 1.0639 1.0667 1.0712 1.0699 1.0646 1.0612 1.0885 1.0600 1.0960 1.1006 1.0990 1.0961 1.1017 1.1030 1.0888 1.0893 1.0937 1.0953 1.0450 1.0640 1.0973
irintensity: 0.5098 0.4086 0.7423 0.4102 1.6556 0.4664 0.4891 1.0973 0.1020 1.6671 5.6005 1.4096 4.6844 7.8328 30.1065 1.1154 13.6963 0.6796 0.1730 7.2446 3.9505 6.1556 0.1036 14.1589 1.2587 5.8505 24.1352 29.5061 18.0653 8.9817 26.5128 169.8540 5.8118 40.5405 108.9053 12.7892 0.7204 10.8139 7.1924 5.2316 3.5267 6.0084 18.3534 6.6402 5.2073 0.6500 24.6812 2.3556 58.8971 0.3403 3.7187 54.9353 4.9789 5.1272 3.2375 204.4468 1.8058 1.3696 1.4236 9.7064 101.3019 0.5942 3.7092 8.7003 13.9231 3.6402 8.3220 43.0556 14.3782 31.2606 21.5582 2.5638 36.9439 43.0453 16.0805 3.0790 55.9782 22.4449 54.3708 3.0895 0.1575 1.6773 22.9876 0.7070 21.9265 17.3036 33.1322 12.5762 10.8905 20.0657 33.9212 2.9088 7.5711 11.5122 12.7680 11.3832 3.9396 0.2671 102.4356 64.7632 45.9274 43.7829 226.1879 114.9342 11.3217 25.6324 54.5495 11.8764 30.7354 16.6917 6.0019 32.2336 18.7999 87.4309 39.4762 0.1259 17.2904 64.7494 15.5271 12.0598 20.5870 19.8030 1.7337 1.4867 20.9762 0.5052
temp: 298.150 k
press: 1.00000 atm
elementType: 8 8 8 7 6 6 6 6 6 6 6 6 6 6 6 6 6 6 6 6 6 1 1 1 1 1 1 1 1 1 1 1 1 1 1 1 1 1 1 1 1 1 1 1
symmnumber: 1
zpe: 969434.6 jmol-1
zpe.correction: 0.369238 hartree
zpe.thermalcorrener: 0.389618 hartree
zpe.thermalcorrenthalpy: 0.390562 hartree
zpe.thermalcorrgfe: 0.316671 hartree
zpe.sumelectzpe: -940.456432 hartree
zpe.sumelectthermal: -940.436052 hartree
zpe.sumelectthermalent: -940.435108 hartree
zpe.sumelectthermalfe: -940.508999 hartree
dipole: 0.9544 -2.9676 0.5663
dipole: 3.1683
quadrupole: -105.4385 -131.1458 -127.5154
quadrupole: -2.0408 10.9609 -0.4501
quadrupole: 15.9281 -9.7793 -6.1488 -2.0408 10.9609 -0.4501
hfenergy: -940.8256698 hartree
pointgroup: C01 [X(C17H23N1O3)]
dipole: 0.3430544 -1.137742 0.3763853 debye
polarizability: 286.2015698|0.1328657|170.9215926|-8.0271948|-15.0073105|151.9505288 unknown
InChI: InChI=1S/C17H23NO3/c18-11-13-3-8-15(9-4-13)17(21)14-6-1-12(2-7-14)5-10-16(19)20/h1-2,6-7,13,15,19H,3-5,8-11,18H2
charge 0 multiplicity 1
44 atoms
O  1.553092 2.227978 -1.487303
O  -6.892058 -2.051599 -0.745312
O  -7.138903 -0.456767 0.92479
N  6.49109 -2.896293 -0.317576
C  5.064875 -0.856073 -0.090709
C  2.411646 0.556731 0.062015
C  3.730374 -1.637275 -0.075922
C  4.901081 0.492919 0.651018
C  2.576815 -0.809804 -0.684137
C  3.748963 1.336636 0.059911
C  6.227393 -1.689283 0.495742
C  1.28613 1.359287 -0.601143
C  -0.148867 1.081024 -0.235194
C  -0.534879 0.139199 0.756371
C  -1.167751 1.803349 -0.914821
C  -2.914331 0.65198 0.37925
C  -1.89692 -0.069424 1.055695
C  -2.524679 1.592567 -0.611939
C  -4.382401 0.397556 0.681124
C  -4.948397 -0.741856 -0.202528
C  -6.410669 -1.024697 0.082024
H  5.310345 -0.625337 -1.152933
H  2.138925 0.329903 1.113038
H  3.482985 -1.900212 0.97558
H  3.859482 -2.589787 -0.621453
H  5.845682 1.070994 0.603096
H  4.705053 0.291724 1.726442
H  2.789104 -0.600863 -1.752092
H  1.631432 -1.384787 -0.649578
H  3.630789 2.278363 0.629679
H  3.984176 1.630111 -0.98037
H  5.948879 -2.022174 1.515681
H  7.118071 -1.022164 0.607651
H  7.074815 -3.600109 0.144366
H  6.829944 -2.685276 -1.26247
H  0.223045 -0.429713 1.304503
H  -0.858703 2.529623 -1.67403
H  -2.176313 -0.79267 1.831823
H  -3.29584 2.167662 -1.139398
H  -4.522048 0.126903 1.743246
H  -4.979264 1.311358 0.509418
H  -4.843978 -0.500537 -1.277428
H  -4.379371 -1.679348 -0.052998
H  -7.852015 -2.21702 -0.537833
