program: Orca
programVersion: 5.0.2
elementType: Cl O O O O O N N C C C C C C C C C C C C C C C C C C C H H H H H H H H H H H H H H H H H H H H H H H H H H H
charge: 0
multiplicity: 1
keywords: wb97x-d3
keywords: def2-TZVPP
keywords: def2/J RIJCOSX
keywords: DEFGRID2
keywords: scfconv7
keywords: smallprint printgap noloewdin
keywords: NOSOSCF
formula: C19H27ClN2O5
InChI: InChI=1/C19H27ClN2O5/c1-11(2)17(22-19(25)27-12(3)4)18(24)21-15(10-16(23)26-5)13-6-8-14(20)9-7-13/h6-9,11-12,15,17,21-22H,10H2,1-5H3
54 atoms
Cl -4.989426 2.686875 0.563569
O  0.564241 -2.921552 -1.980511
O  2.187981 2.227158 -1.310206
O  -0.286058 -2.346674 3.718262
O  1.170937 0.986393 -2.903845
O  0.312487 -0.618932 2.441134
N  0.295759 -1.290653 -0.433365
N  2.506025 0.041142 -1.335102
C  2.314967 -1.309822 -1.799377
C  3.443922 -2.237595 -1.311219
C  -0.942405 -1.773515 0.136438
C  0.962111 -1.907545 -1.413192
C  3.458964 -2.431404 0.202163
C  4.798379 -1.759143 -1.819087
C  -0.689109 -2.560271 1.420762
C  -1.943175 -0.641569 0.280841
C  1.89331 1.085787 -1.92697
C  -2.907363 -0.638036 1.285354
C  -1.952031 0.403738 -0.639227
C  -0.171099 -1.721768 2.556527
C  -3.84704 0.378295 1.379102
C  -2.882328 1.427765 -0.559341
C  1.587734 3.457623 -1.776415
C  -3.825633 1.407563 0.453862
C  2.457631 4.572255 -1.237339
C  0.15379 3.564292 -1.296961
C  0.191293 -1.669671 4.883921
H  2.343307 -1.315856 -2.892157
H  3.240179 -3.207123 -1.772083
H  -1.361082 -2.486109 -0.57771
H  0.728292 -0.495673 0.013737
H  4.268845 -3.107054 0.478895
H  2.533664 -2.871623 0.57762
H  3.62711 -1.496842 0.742296
H  5.565015 -2.503755 -1.60296
H  5.108884 -0.82724 -1.343731
H  4.787209 -1.598369 -2.898354
H  3.102398 0.213528 -0.538434
H  -1.587116 -3.095793 1.731213
H  0.05428 -3.335753 1.211225
H  -2.952417 -1.431377 2.019783
H  -1.223424 0.433102 -1.43884
H  -4.583158 0.361103 2.171247
H  -2.864574 2.231611 -1.28292
H  1.618313 3.473737 -2.868336
H  2.454566 4.5915 -0.146258
H  2.076369 5.53053 -1.588854
H  3.488164 4.479726 -1.580938
H  -0.487631 2.806083 -1.742925
H  0.093604 3.47692 -0.210985
H  -0.250582 4.537423 -1.576959
H  -0.328285 -0.723922 5.035741
H  -0.019561 -2.330739 5.719424
H  1.264886 -1.491062 4.828608
elementType: Cl O N C H
totalener: -1686.35786949 hartree
nucrepener: 2826.54384199 hartree
electener: -4512.90171148 hartree
oneelecener: -7928.79997503 hartree
twoeener: 3415.89826356 hartree
cpcmener: -0.05722213 hartree
kineticenergy: 1680.29988724 hartree
xcener: -138.345731603846 hartree
chargesum: -0.0000000
charge: -0.100763 -0.565953 -0.336324 -0.289116 -0.557266 -0.486167 -0.188780 -0.263340 0.097993 0.064835 0.184527 0.302236 -0.306661 -0.303610 -0.126377 -0.014411 0.528626 -0.226134 -0.176657 0.411580 -0.144743 -0.174463 0.170466 0.106483 -0.260688 -0.261221 -0.127623 0.110555 0.052097 0.100210 0.186720 0.103870 0.090328 0.087613 0.099087 0.085447 0.097052 0.186357 0.127455 0.134812 0.144091 0.158734 0.144386 0.145952 0.069628 0.090143 0.092393 0.097721 0.073876 0.093814 0.104519 0.116594 0.130435 0.119661
qa: -0.1008 -0.5660 -0.3363 -0.2891 -0.5573 -0.4862 -0.1888 -0.2633 0.0980 0.0648 0.1845 0.3022 -0.3067 -0.3036 -0.1264 -0.0144 0.5286 -0.2261 -0.1767 0.4116 -0.1447 -0.1745 0.1705 0.1065 -0.2607 -0.2612 -0.1276 0.1106 0.0521 0.1002 0.1867 0.1039 0.0903 0.0876 0.0991 0.0854 0.0971 0.1864 0.1275 0.1348 0.1441 0.1587 0.1444 0.1460 0.0696 0.0901 0.0924 0.0977 0.0739 0.0938 0.1045 0.1166 0.1304 0.1197
va: 1.2050 1.9520 2.0848 2.1349 1.9415 1.9871 3.1860 3.1785 3.8159 3.7849 3.7331 4.1908 3.9534 3.9473 3.8945 3.7731 4.2818 4.0102 3.9388 4.0653 4.0006 3.9975 3.8270 3.8223 3.9467 3.8880 3.8640 1.0356 1.0349 1.0394 1.0300 1.0055 1.0108 1.0036 1.0037 1.0053 1.0036 1.0168 1.0129 1.0067 1.0057 1.0068 1.0063 1.0059 1.0189 1.0053 1.0050 1.0080 1.0219 1.0059 1.0079 0.9929 0.9943 0.9921
dispcorr: -0.031511449 hartree
energy: -1686.389380934152
dipole: 36.67258 -35.09263 1.57994 -4.21883 4.29942 0.08059 0.82190 2.15434 2.97624
magnitude: 3.37056 au
magnitude: 8.56729 debye
