program: Orca
programVersion: 5.0.2
elementType: Cl O O O O O N N C C C C C C C C C C C C C C C C C C C H H H H H H H H H H H H H H H H H H H H H H H H H H H
charge: 0
multiplicity: 1
keywords: wb97x-d3
keywords: def2-TZVPP
keywords: def2/J RIJCOSX
keywords: DEFGRID2
keywords: scfconv7
keywords: smallprint printgap noloewdin
keywords: NOSOSCF
formula: C19H27ClN2O5
InChI: InChI=1/C19H27ClN2O5/c1-11(2)17(22-19(25)27-12(3)4)18(24)21-15(10-16(23)26-5)13-6-8-14(20)9-7-13/h6-9,11-12,15,17,21-22H,10H2,1-5H3
54 atoms
Cl -6.998017 -1.591015 -1.130411
O  1.026678 -1.761402 0.389889
O  4.71638 0.952714 -0.168863
O  0.543667 1.625773 2.184389
O  3.088453 2.248333 -1.050328
O  0.375696 -0.115609 3.571392
N  -0.560278 -0.191058 0.012056
N  2.822289 0.006311 -0.761782
C  1.48359 -0.112214 -1.287328
C  1.460632 -0.921359 -2.597251
C  -1.481307 -0.593216 1.057129
C  0.625709 -0.769262 -0.210645
C  2.244871 -0.186346 -3.67732
C  0.036711 -1.192529 -3.068631
C  -1.49615 0.457127 2.181886
C  -2.867181 -0.829358 0.507105
C  3.504651 1.161088 -0.687684
C  -3.566181 0.180658 -0.148537
C  -3.467506 -2.073867 0.650882
C  -0.109301 0.617796 2.741264
C  -4.835489 -0.045471 -0.655924
C  -4.739508 -2.317402 0.153041
C  5.623771 2.066063 -0.022992
C  -5.411129 -1.297667 -0.499365
C  7.011842 1.464718 0.031719
C  5.294238 2.862416 1.224003
C  1.913484 1.816338 2.546752
H  1.108873 0.891892 -1.496488
H  1.948364 -1.882425 -2.400717
H  -1.114535 -1.532915 1.468566
H  -0.778508 0.655993 -0.493858
H  3.280071 -0.001242 -3.390094
H  1.782809 0.775746 -3.909521
H  2.264782 -0.773403 -4.596268
H  0.052032 -1.688496 -4.039614
H  -0.52891 -0.26499 -3.183519
H  -0.515245 -1.841988 -2.388645
H  3.272709 -0.84196 -0.450082
H  -1.87536 1.406144 1.800517
H  -2.161179 0.114036 2.974352
H  -3.126782 1.163816 -0.271805
H  -2.939163 -2.872125 1.157154
H  -5.366707 0.746514 -1.165926
H  -5.192894 -3.291873 0.272752
H  5.5453 2.70635 -0.904606
H  7.232165 0.882819 -0.863598
H  7.136347 0.821371 0.90427
H  7.750928 2.262583 0.097755
H  4.322127 3.349029 1.15794
H  5.306642 2.22725 2.111433
H  6.040551 3.645193 1.362666
H  2.257253 2.662217 1.959793
H  2.015925 2.050448 3.60625
H  2.514729 0.939209 2.30939
elementType: Cl O N C H
totalener: -1686.35821240 hartree
nucrepener: 2745.40497220 hartree
electener: -4431.76318460 hartree
oneelecener: -7765.92197835 hartree
twoeener: 3334.15879375 hartree
cpcmener: -0.06152537 hartree
kineticenergy: 1680.31489420 hartree
xcener: -138.340261817613 hartree
chargesum: -0.0000000
charge: -0.099352 -0.559039 -0.339732 -0.276633 -0.565357 -0.483132 -0.168309 -0.209553 0.059462 0.079162 0.249425 0.298206 -0.309790 -0.308843 -0.136959 -0.059700 0.515918 -0.219399 -0.171661 0.421890 -0.163273 -0.159400 0.171937 0.107472 -0.258667 -0.289132 -0.136225 0.101170 0.053357 0.097972 0.186501 0.094543 0.088489 0.100329 0.095365 0.092389 0.092670 0.172023 0.114127 0.113985 0.149024 0.145917 0.146107 0.144852 0.066516 0.097046 0.089745 0.092263 0.094387 0.094481 0.106696 0.128195 0.139690 0.112842
qa: -0.0994 -0.5590 -0.3397 -0.2766 -0.5654 -0.4831 -0.1683 -0.2096 0.0595 0.0792 0.2494 0.2982 -0.3098 -0.3088 -0.1370 -0.0597 0.5159 -0.2194 -0.1717 0.4219 -0.1633 -0.1594 0.1719 0.1075 -0.2587 -0.2891 -0.1362 0.1012 0.0534 0.0980 0.1865 0.0945 0.0885 0.1003 0.0954 0.0924 0.0927 0.1720 0.1141 0.1140 0.1490 0.1459 0.1461 0.1449 0.0665 0.0970 0.0897 0.0923 0.0944 0.0945 0.1067 0.1282 0.1397 0.1128
va: 1.2046 1.9495 2.0730 2.1178 1.9232 2.0182 3.2216 3.1893 3.8694 3.7873 3.6519 4.1687 3.9378 3.9569 3.8527 3.6071 4.2894 4.0125 3.9838 4.1480 4.0035 3.9938 3.8071 3.8155 3.9412 3.9001 3.8318 1.0515 1.0290 1.0679 1.0008 1.0087 1.0012 1.0043 1.0061 1.0017 1.0079 1.0352 1.0294 1.0259 1.0038 1.0030 1.0054 1.0064 1.0203 1.0080 1.0056 1.0054 1.0158 1.0034 1.0089 1.0035 0.9940 1.0004
dispcorr: -0.030785264 hartree
energy: -1686.388997666513
dipole: 47.60443 -47.51747 0.08696 13.48119 -12.09835 1.38284 -6.18625 5.31580 -0.87046
magnitude: 1.63631 au
magnitude: 4.15917 debye
