program: Orca
programVersion: 5.0.2
elementType: Cl O O O O O N N C C C C C C C C C C C C C C C C C C C H H H H H H H H H H H H H H H H H H H H H H H H H H H
charge: 0
multiplicity: 1
keywords: wb97x-d3
keywords: def2-TZVPP
keywords: def2/J RIJCOSX
keywords: DEFGRID2
keywords: scfconv7
keywords: smallprint printgap noloewdin
keywords: NOSOSCF
formula: C19H27ClN2O5
InChI: InChI=1/C19H27ClN2O5/c1-11(2)17(22-19(25)27-12(3)4)18(24)21-15(10-16(23)26-5)13-6-8-14(20)9-7-13/h6-9,11-12,15,17,21-22H,10H2,1-5H3
54 atoms
Cl -5.82241 -1.728967 -1.53608
O  1.131622 -1.436333 -0.75637
O  4.98636 0.654558 -1.960059
O  -2.742394 -0.391724 4.07759
O  4.352473 1.936793 -0.212912
O  -1.430955 1.042962 2.986321
N  0.290077 -0.319692 1.016476
N  2.886167 0.573838 -1.294708
C  1.731085 0.88474 -0.494123
C  0.73418 1.834949 -1.196926
C  -0.594247 -1.380736 1.441584
C  1.033112 -0.409236 -0.094954
C  0.111269 1.223776 -2.44566
C  1.397783 3.168651 -1.514418
C  -0.886857 -1.293847 2.944169
C  -1.883566 -1.44019 0.647105
C  4.09371 1.126572 -1.087499
C  -2.446257 -0.317051 0.051283
C  -2.559079 -2.653234 0.552852
C  -1.703017 -0.089128 3.322186
C  -3.657491 -0.399082 -0.622409
C  -3.768778 -2.753078 -0.114745
C  6.342845 1.147945 -1.905978
C  -4.310174 -1.617884 -0.697588
C  6.45229 2.455659 -2.663254
C  7.212159 0.061054 -2.500041
C  -3.577711 0.68283 4.5196
H  2.076426 1.384439 0.412454
H  -0.065722 2.026963 -0.47467
H  -0.067815 -2.325775 1.297575
H  0.202643 0.581367 1.465061
H  -0.549114 1.947173 -2.925518
H  -0.488868 0.339354 -2.228171
H  0.86928 0.943877 -3.180292
H  1.836636 3.623942 -0.625766
H  0.660754 3.867557 -1.91215
H  2.183068 3.064939 -2.265555
H  2.775241 -0.079082 -2.056286
H  -1.391595 -2.208989 3.249562
H  0.056309 -1.248302 3.496095
H  -1.94736 0.642733 0.095397
H  -2.134231 -3.541532 1.005249
H  -4.081085 0.484203 -1.08081
H  -4.276701 -3.705535 -0.18152
H  6.62549 1.298697 -0.862106
H  5.820612 3.233047 -2.233335
H  6.178232 2.327478 -3.711659
H  7.481808 2.812809 -2.6284
H  6.96145 -0.130493 -3.544557
H  8.256478 0.369627 -2.459026
H  7.121233 -0.872177 -1.943589
H  -4.358547 0.224412 5.118938
H  -3.022193 1.391624 5.132829
H  -4.029647 1.20427 3.67642
elementType: Cl O N C H
totalener: -1686.35941625 hartree
nucrepener: 2708.72772461 hartree
electener: -4395.08714086 hartree
oneelecener: -7693.43515207 hartree
twoeener: 3298.34801121 hartree
cpcmener: -0.05403403 hartree
kineticenergy: 1680.31280151 hartree
xcener: -138.344322915725 hartree
chargesum: -0.0000000
charge: -0.100159 -0.551232 -0.345078 -0.279323 -0.569534 -0.491593 -0.219466 -0.244147 0.109741 0.076842 0.185683 0.291162 -0.311531 -0.325186 -0.122636 0.080633 0.526883 -0.265480 -0.228405 0.437944 -0.155655 -0.145072 0.157744 0.101796 -0.260923 -0.255188 -0.124789 0.118506 0.050418 0.103286 0.188752 0.100035 0.089995 0.093729 0.098755 0.103289 0.089025 0.172046 0.103854 0.124543 0.167740 0.144889 0.142604 0.144605 0.065495 0.091954 0.088962 0.097971 0.089192 0.091569 0.096737 0.131005 0.119187 0.118824
qa: -0.1002 -0.5512 -0.3451 -0.2793 -0.5695 -0.4916 -0.2195 -0.2441 0.1097 0.0768 0.1857 0.2912 -0.3115 -0.3252 -0.1226 0.0806 0.5269 -0.2655 -0.2284 0.4379 -0.1557 -0.1451 0.1577 0.1018 -0.2609 -0.2552 -0.1248 0.1185 0.0504 0.1033 0.1888 0.1000 0.0900 0.0937 0.0988 0.1033 0.0890 0.1720 0.1039 0.1245 0.1677 0.1449 0.1426 0.1446 0.0655 0.0920 0.0890 0.0980 0.0892 0.0916 0.0967 0.1310 0.1192 0.1188
va: 1.2048 1.9446 2.0819 2.1418 1.9243 1.9927 3.2326 3.2107 3.7692 3.7756 3.7771 4.2679 3.9435 3.9460 3.9092 3.4518 4.2982 3.9720 4.0487 4.0697 4.0427 3.9738 3.8297 3.8205 3.9032 3.9386 3.8583 1.0411 1.0321 1.0252 1.0222 1.0035 1.0095 1.0064 1.0064 1.0052 1.0036 1.0362 1.0246 1.0125 0.9883 1.0021 1.0071 1.0050 1.0233 1.0182 1.0074 1.0064 1.0065 1.0051 1.0077 0.9944 0.9932 0.9927
dispcorr: -0.029384637 hartree
energy: -1686.388800886315
dipole: 37.60338 -38.35796 -0.75459 19.41144 -19.45682 -0.04538 -5.21683 6.67757 1.46074
magnitude: 1.64475 au
magnitude: 4.18063 debye
