program: Orca
programVersion: 5.0.2
elementType: Cl O O O O O N N C C C C C C C C C C C C C C C C C C C H H H H H H H H H H H H H H H H H H H H H H H H H H H
charge: 0
multiplicity: 1
keywords: wb97x-d3
keywords: def2-TZVPP
keywords: def2/J RIJCOSX
keywords: DEFGRID2
keywords: scfconv7
keywords: smallprint printgap noloewdin
keywords: NOSOSCF
formula: C19H27ClN2O5
InChI: InChI=1/C19H27ClN2O5/c1-11(2)17(22-19(25)27-12(3)4)18(24)21-15(10-16(23)26-5)13-6-8-14(20)9-7-13/h6-9,11-12,15,17,21-22H,10H2,1-5H3
54 atoms
Cl -5.723418 -1.742826 -1.62453
O  1.056032 -1.395585 -0.786106
O  4.918737 0.640698 -2.062587
O  -2.798533 -0.454738 4.012739
O  4.412417 1.858199 -0.229671
O  -1.380331 0.990685 3.080042
N  0.326041 -0.363474 1.082176
N  2.855987 0.577699 -1.284935
C  1.753753 0.88238 -0.410143
C  0.770354 1.917382 -1.00219
C  -0.565959 -1.430177 1.478023
C  1.02178 -0.407324 -0.061927
C  0.074058 1.421673 -2.263792
C  1.475385 3.242733 -1.259245
C  -0.884424 -1.355205 2.976274
C  -1.840791 -1.479579 0.659545
C  4.086307 1.093301 -1.122057
C  -2.402235 -0.344238 0.086205
C  -2.501504 -2.695735 0.51571
C  -1.699088 -0.146871 3.349107
C  -3.596117 -0.418069 -0.618573
C  -3.694836 -2.787321 -0.182094
C  6.284777 1.109426 -2.064674
C  -4.233091 -1.64089 -0.745312
C  6.373201 2.476837 -2.713275
C  7.085104 0.066098 -2.813584
C  -3.642857 0.621527 4.43353
H  2.161993 1.305246 0.509403
H  0.00793 2.090501 -0.235659
H  -0.039418 -2.375613 1.334327
H  0.280374 0.510904 1.586595
H  -0.597436 2.191783 -2.645407
H  -0.528891 0.529268 -2.091533
H  0.789878 1.196114 -3.057034
H  1.966277 3.62225 -0.362168
H  0.753409 3.993939 -1.582294
H  2.226056 3.157231 -2.047125
H  2.68765 -0.043129 -2.062729
H  -1.401018 -2.26953 3.263189
H  0.049679 -1.319565 3.543435
H  -1.913787 0.618211 0.172506
H  -2.0772 -3.592805 0.950911
H  -4.01879 0.473518 -1.061483
H  -4.191923 -3.741851 -0.288787
H  6.64265 1.162514 -1.034264
H  5.789731 3.22604 -2.178649
H  6.02904 2.444021 -3.748213
H  7.410854 2.811423 -2.716863
H  6.762499 -0.018694 -3.852549
H  8.137607 0.348223 -2.813417
H  7.005059 -0.914336 -2.343487
H  -3.123455 1.287275 5.122195
H  -4.011964 1.191713 3.581351
H  -4.480832 0.158474 4.945915
elementType: Cl O N C H
totalener: -1686.35961908 hartree
nucrepener: 2714.29363160 hartree
electener: -4400.65325068 hartree
oneelecener: -7704.60349420 hartree
twoeener: 3303.95024352 hartree
cpcmener: -0.05410958 hartree
kineticenergy: 1680.30834007 hartree
xcener: -138.343687973875 hartree
chargesum: 0.0000000
charge: -0.100632 -0.549092 -0.344971 -0.278290 -0.568772 -0.489517 -0.217298 -0.246293 0.120280 0.076268 0.178300 0.285176 -0.314707 -0.327039 -0.123711 0.076630 0.525075 -0.260497 -0.226870 0.434102 -0.157841 -0.144571 0.158743 0.102307 -0.261538 -0.257108 -0.125271 0.118641 0.050506 0.105610 0.189515 0.100652 0.091380 0.093847 0.099406 0.102946 0.088565 0.172866 0.103592 0.125891 0.169446 0.144457 0.142853 0.144700 0.066117 0.091128 0.089004 0.098278 0.089105 0.092091 0.097146 0.120094 0.118823 0.130479
qa: -0.1006 -0.5491 -0.3450 -0.2783 -0.5688 -0.4895 -0.2173 -0.2463 0.1203 0.0763 0.1783 0.2852 -0.3147 -0.3270 -0.1237 0.0766 0.5251 -0.2605 -0.2269 0.4341 -0.1578 -0.1446 0.1587 0.1023 -0.2615 -0.2571 -0.1253 0.1186 0.0505 0.1056 0.1895 0.1007 0.0914 0.0938 0.0994 0.1029 0.0886 0.1729 0.1036 0.1259 0.1694 0.1445 0.1429 0.1447 0.0661 0.0911 0.0890 0.0983 0.0891 0.0921 0.0971 0.1201 0.1188 0.1305
va: 1.2041 1.9461 2.0819 2.1388 1.9246 1.9949 3.2353 3.2113 3.7557 3.7747 3.7957 4.2735 3.9433 3.9449 3.9074 3.4282 4.2990 3.9731 4.0506 4.0751 4.0439 3.9751 3.8283 3.8163 3.8983 3.9407 3.8578 1.0397 1.0325 1.0208 1.0222 1.0034 1.0088 1.0074 1.0066 1.0054 1.0031 1.0363 1.0256 1.0121 0.9863 1.0023 1.0069 1.0049 1.0221 1.0199 1.0072 1.0066 1.0063 1.0050 1.0077 0.9930 0.9927 0.9943
dispcorr: -0.029596160 hartree
energy: -1686.389215239549
dipole: 36.90433 -37.69043 -0.78610 20.06848 -20.13819 -0.06971 -4.70966 6.21313 1.50347
magnitude: 1.69801 au
magnitude: 4.31600 debye
