program: Orca
programVersion: 5.0.2
elementType: Cl O O O O O N N C C C C C C C C C C C C C C C C C C C H H H H H H H H H H H H H H H H H H H H H H H H H H H
charge: 0
multiplicity: 1
keywords: wb97x-d3
keywords: def2-TZVPP
keywords: def2/J RIJCOSX
keywords: DEFGRID2
keywords: scfconv7
keywords: smallprint printgap noloewdin
keywords: NOSOSCF
formula: C19H27ClN2O5
InChI: InChI=1/C19H27ClN2O5/c1-11(2)17(22-19(25)27-12(3)4)18(24)21-15(10-16(23)26-5)13-6-8-14(20)9-7-13/h6-9,11-12,15,17,21-22H,10H2,1-5H3
54 atoms
Cl -6.226521 -0.423805 -0.382265
O  0.567052 -0.562312 -1.63186
O  4.369782 1.777723 -2.520744
O  -2.08682 -2.601819 3.489128
O  4.480977 1.664958 -0.26851
O  -0.533091 -1.001813 3.462502
N  0.458108 -0.837917 0.603736
N  2.537359 1.297008 -1.391635
C  1.715431 1.037304 -0.238741
C  0.818283 2.230264 0.1594
C  -0.473229 -1.941344 0.55267
C  0.866172 -0.1991 -0.500176
C  -0.189756 2.601678 -0.921458
C  1.668285 3.432313 0.550697
C  -0.40999 -2.769516 1.845573
C  -1.897092 -1.507214 0.272343
C  3.847082 1.586085 -1.307673
C  -2.768348 -2.401586 -0.340753
C  -2.383901 -0.268074 0.674071
C  -0.996792 -2.027444 3.01441
C  -4.099575 -2.07826 -0.548289
C  -3.714757 0.072003 0.474372
C  5.792608 2.001223 -2.633933
C  -4.562344 -0.839368 -0.132719
C  6.006894 2.684141 -3.966912
C  6.540338 0.686481 -2.53754
C  -2.76735 -1.946512 4.56379
H  2.37561 0.825701 0.604051
H  0.264601 1.911847 1.048808
H  -0.156396 -2.611489 -0.248589
H  0.697132 -0.447723 1.504307
H  0.302542 2.882755 -1.854789
H  -0.781923 3.459637 -0.60049
H  -0.890956 1.795448 -1.141273
H  2.386526 3.181262 1.332142
H  1.033624 4.233393 0.931683
H  2.219716 3.83388 -0.301348
H  2.105852 1.255778 -2.303069
H  -0.941966 -3.70403 1.677204
H  0.630228 -3.015368 2.070388
H  -2.405097 -3.369397 -0.665562
H  -1.731625 0.456356 1.145628
H  -4.762935 -2.783868 -1.029709
H  -4.079517 1.039007 0.793041
H  6.111629 2.670838 -1.832365
H  7.067329 2.897591 -4.097692
H  5.468836 3.630447 -4.025479
H  5.689303 2.051131 -4.797072
H  7.610958 0.867784 -2.63568
H  6.379811 0.188746 -1.581529
H  6.241842 0.005727 -3.336401
H  -3.604877 -2.588503 4.82065
H  -2.122769 -1.82938 5.434532
H  -3.142984 -0.971762 4.252095
elementType: Cl O N C H
totalener: -1686.35898922 hartree
nucrepener: 2720.37759048 hartree
electener: -4406.73657969 hartree
oneelecener: -7716.65949497 hartree
twoeener: 3309.92291527 hartree
cpcmener: -0.05444894 hartree
kineticenergy: 1680.31663832 hartree
xcener: -138.344708671321 hartree
chargesum: 0.0000000
charge: -0.100284 -0.550361 -0.346804 -0.273622 -0.570267 -0.483329 -0.210968 -0.244192 0.115027 0.073412 0.172361 0.291444 -0.312263 -0.325366 -0.128735 0.058771 0.526459 -0.216350 -0.238421 0.420281 -0.148855 -0.171364 0.162440 0.112209 -0.257808 -0.262727 -0.123199 0.118343 0.051834 0.106193 0.185798 0.092517 0.100422 0.090280 0.098731 0.103143 0.090022 0.173057 0.106322 0.124390 0.144868 0.167792 0.144339 0.143340 0.064720 0.091577 0.097819 0.089829 0.098401 0.091345 0.089018 0.131054 0.119632 0.117724
qa: -0.1003 -0.5504 -0.3468 -0.2736 -0.5703 -0.4833 -0.2110 -0.2442 0.1150 0.0734 0.1724 0.2914 -0.3123 -0.3254 -0.1287 0.0588 0.5265 -0.2163 -0.2384 0.4203 -0.1489 -0.1714 0.1624 0.1122 -0.2578 -0.2627 -0.1232 0.1183 0.0518 0.1062 0.1858 0.0925 0.1004 0.0903 0.0987 0.1031 0.0900 0.1731 0.1063 0.1244 0.1449 0.1678 0.1443 0.1433 0.0647 0.0916 0.0978 0.0898 0.0984 0.0913 0.0890 0.1311 0.1196 0.1177
va: 1.2043 1.9446 2.0832 2.1310 1.9228 2.0022 3.2409 3.2128 3.7658 3.7723 3.8115 4.2704 3.9436 3.9423 3.9006 3.4284 4.2982 4.0426 3.9505 4.1009 3.9832 4.0549 3.8254 3.8074 3.9374 3.8991 3.8543 1.0403 1.0317 1.0207 1.0219 1.0073 1.0032 1.0097 1.0063 1.0052 1.0031 1.0363 1.0265 1.0158 1.0021 0.9904 1.0051 1.0070 1.0226 1.0051 1.0077 1.0062 1.0059 1.0201 1.0074 0.9943 0.9945 0.9921
dispcorr: -0.029817778 hartree
energy: -1686.388806996315
dipole: 38.57581 -39.03849 -0.46268 15.44153 -16.41915 -0.97762 -3.91653 5.04594 1.12941
magnitude: 1.56377 au
magnitude: 3.97480 debye
