program: Orca
programVersion: 5.0.2
elementType: Cl O O O O O N N C C C C C C C C C C C C C C C C C C C H H H H H H H H H H H H H H H H H H H H H H H H H H H
charge: 0
multiplicity: 1
keywords: wb97x-d3
keywords: def2-TZVPP
keywords: def2/J RIJCOSX
keywords: DEFGRID2
keywords: scfconv7
keywords: smallprint printgap noloewdin
keywords: NOSOSCF
formula: C19H27ClN2O5
InChI: InChI=1/C19H27ClN2O5/c1-11(2)17(22-19(25)27-12(3)4)18(24)21-15(10-16(23)26-5)13-6-8-14(20)9-7-13/h6-9,11-12,15,17,21-22H,10H2,1-5H3
54 atoms
Cl -6.137443 -1.071115 -0.990051
O  0.839123 -1.125313 -1.254577
O  4.735327 0.878881 -2.322408
O  -2.370192 -1.340334 4.044618
O  4.430399 1.714849 -0.24709
O  -0.953027 0.261481 3.414596
N  0.353575 -0.539296 0.868589
N  2.711931 0.834591 -1.450791
C  1.693826 0.978691 -0.443618
C  0.725964 2.152228 -0.716628
C  -0.524311 -1.659453 1.117779
C  0.928089 -0.333295 -0.323084
C  -0.088046 1.967697 -1.991526
C  1.484928 3.473269 -0.742544
C  -0.605232 -1.97361 2.618351
C  -1.912813 -1.474493 0.540067
C  3.993198 1.190302 -1.257626
C  -2.461429 -0.219388 0.304829
C  -2.690117 -2.60161 0.290669
C  -1.311145 -0.895787 3.393543
C  -3.760495 -0.087889 -0.168155
C  -3.987997 -2.488741 -0.17926
C  6.138143 1.221816 -2.315773
C  -4.513816 -1.22526 -0.402825
C  6.3227 2.672509 -2.712503
C  6.809042 0.267994 -3.279539
C  -3.115751 -0.39834 4.821192
H  2.189351 1.177411 0.508514
H  0.033873 2.181134 0.131555
H  -0.078417 -2.540697 0.65333
H  0.413036 0.187182 1.568166
H  -0.737519 1.092179 -1.955222
H  0.552877 1.876699 -2.871085
H  -0.730382 2.834601 -2.151115
H  2.055676 3.631299 0.173564
H  0.787177 4.305571 -0.843648
H  2.175738 3.525655 -1.586066
H  2.456565 0.397035 -2.323562
H  -1.109585 -2.930106 2.742442
H  0.40484 -2.082235 3.021217
H  -1.882921 0.678966 0.480476
H  -2.277622 -3.588718 0.463648
H  -4.17334 0.89545 -0.348243
H  -4.577221 -3.375118 -0.371032
H  6.539861 1.056559 -1.313961
H  5.93973 2.856962 -3.717422
H  7.384333 2.920782 -2.708699
H  5.825101 3.353457 -2.022207
H  7.881494 0.460294 -3.291756
H  6.662626 -0.770431 -2.98114
H  6.435199 0.394072 -4.296903
H  -3.936314 -0.958097 5.259015
H  -2.507063 0.029878 5.616349
H  -3.516682 0.399474 4.197606
elementType: Cl O N C H
totalener: -1686.35920582 hartree
nucrepener: 2710.78731040 hartree
electener: -4397.14651621 hartree
oneelecener: -7697.51475436 hartree
twoeener: 3300.36823815 hartree
cpcmener: -0.05410334 hartree
kineticenergy: 1680.31770758 hartree
xcener: -138.344849639142 hartree
chargesum: -0.0000000
charge: -0.100624 -0.552182 -0.345311 -0.276099 -0.569528 -0.489077 -0.218226 -0.247847 0.112184 0.076712 0.179526 0.293150 -0.312419 -0.325102 -0.129602 0.060542 0.528834 -0.236545 -0.222977 0.431427 -0.169887 -0.150309 0.159633 0.111415 -0.262696 -0.256594 -0.125391 0.117397 0.052556 0.105188 0.189130 0.090443 0.092961 0.099477 0.099157 0.103336 0.088717 0.172306 0.104672 0.124956 0.170160 0.145465 0.143907 0.144700 0.065291 0.089254 0.098214 0.091926 0.091960 0.097164 0.089383 0.130705 0.120681 0.117888
qa: -0.1006 -0.5522 -0.3453 -0.2761 -0.5695 -0.4891 -0.2182 -0.2478 0.1122 0.0767 0.1795 0.2932 -0.3124 -0.3251 -0.1296 0.0605 0.5288 -0.2365 -0.2230 0.4314 -0.1699 -0.1503 0.1596 0.1114 -0.2627 -0.2566 -0.1254 0.1174 0.0526 0.1052 0.1891 0.0904 0.0930 0.0995 0.0992 0.1033 0.0887 0.1723 0.1047 0.1250 0.1702 0.1455 0.1439 0.1447 0.0653 0.0893 0.0982 0.0919 0.0920 0.0972 0.0894 0.1307 0.1207 0.1179
va: 1.2039 1.9427 2.0825 2.1359 1.9243 1.9956 3.2397 3.2108 3.7713 3.7744 3.7927 4.2623 3.9443 3.9458 3.9084 3.4604 4.2954 3.9545 4.0428 4.0793 4.0509 3.9830 3.8272 3.8090 3.9025 3.9382 3.8578 1.0412 1.0308 1.0223 1.0218 1.0097 1.0064 1.0037 1.0062 1.0052 1.0037 1.0370 1.0252 1.0145 0.9873 1.0022 1.0071 1.0049 1.0233 1.0072 1.0064 1.0188 1.0051 1.0077 1.0064 0.9944 0.9930 0.9930
dispcorr: -0.029412002 hartree
energy: -1686.388617819058
dipole: 38.43689 -39.00673 -0.56984 18.50061 -18.96847 -0.46786 -5.46044 6.87761 1.41716
magnitude: 1.59749 au
magnitude: 4.06049 debye
