program: Orca
programVersion: 5.0.2
elementType: Cl O O O O O N N C C C C C C C C C C C C C C C C C C C H H H H H H H H H H H H H H H H H H H H H H H H H H H
charge: 0
multiplicity: 1
keywords: wb97x-d3
keywords: def2-TZVPP
keywords: def2/J RIJCOSX
keywords: DEFGRID2
keywords: scfconv7
keywords: smallprint printgap noloewdin
keywords: NOSOSCF
formula: C19H27ClN2O5
InChI: InChI=1/C19H27ClN2O5/c1-11(2)17(22-19(25)27-12(3)4)18(24)21-15(10-16(23)26-5)13-6-8-14(20)9-7-13/h6-9,11-12,15,17,21-22H,10H2,1-5H3
54 atoms
Cl -4.031182 3.027039 0.703614
O  0.48871 -1.316786 -2.47685
O  1.344758 1.530744 -1.396827
O  -1.472043 -2.005275 3.267666
O  2.263591 2.156482 0.568632
O  0.69745 -2.085281 2.755502
N  0.6881 -1.665288 -0.253484
N  2.83229 0.206445 -0.439796
C  2.611078 -0.803484 -1.455275
C  3.588767 -1.972756 -1.253201
C  -0.711751 -1.949229 -0.022958
C  1.155668 -1.278026 -1.449723
C  5.033061 -1.504348 -1.397541
C  3.301164 -3.0962 -2.242518
C  -0.900162 -2.905232 1.166025
C  -1.526434 -0.683538 0.150224
C  2.147475 1.365146 -0.351651
C  -2.783846 -0.583691 -0.433227
C  -1.057904 0.382941 0.912823
C  -0.461008 -2.300599 2.470958
C  -3.564958 0.550491 -0.266186
C  -1.826438 1.52182 1.093903
C  0.486876 2.691983 -1.466019
C  -3.07498 1.596642 0.497732
C  -0.686785 2.291988 -2.333762
C  1.252295 3.872937 -2.02597
C  -1.169333 -1.365069 4.510532
H  2.794452 -0.383255 -2.44817
H  3.451457 -2.36111 -0.237531
H  -1.091783 -2.484035 -0.893964
H  1.286706 -1.547032 0.551857
H  5.208989 -1.081615 -2.388887
H  5.713149 -2.347304 -1.271006
H  5.314071 -0.754214 -0.658349
H  3.353111 -2.739415 -3.272983
H  2.323235 -3.554134 -2.092644
H  4.042821 -3.887143 -2.130692
H  3.413863 -0.025571 0.352527
H  -1.951019 -3.186718 1.206241
H  -0.316958 -3.81099 0.990312
H  -3.163227 -1.400015 -1.036041
H  -0.079535 0.351018 1.376635
H  -4.536919 0.616084 -0.735906
H  -1.447577 2.342328 1.687851
H  0.127704 2.92388 -0.461373
H  -0.373635 2.072331 -3.355669
H  -1.403639 3.111747 -2.371439
H  -1.201865 1.417984 -1.934096
H  2.09311 4.153705 -1.392296
H  1.627819 3.660477 -3.02802
H  0.589407 4.735848 -2.093372
H  -0.530187 -1.988588 5.134282
H  -0.692193 -0.398549 4.349834
H  -2.122476 -1.216559 5.008282
elementType: Cl O N C H
totalener: -1686.35716247 hartree
nucrepener: 2929.60115308 hartree
electener: -4615.95831556 hartree
oneelecener: -8135.07205842 hartree
twoeener: 3519.11374286 hartree
cpcmener: -0.05812335 hartree
kineticenergy: 1680.30954637 hartree
xcener: -138.344375745897 hartree
chargesum: 0.0000000
charge: -0.100048 -0.541915 -0.295892 -0.271671 -0.553650 -0.484152 -0.172792 -0.235029 0.099826 0.061318 0.170211 0.243949 -0.294494 -0.308157 -0.104072 0.090350 0.482471 -0.220342 -0.263779 0.405488 -0.129965 -0.163124 0.134386 0.094600 -0.266314 -0.262381 -0.127319 0.104971 0.059082 0.099188 0.184024 0.089992 0.095989 0.093907 0.096309 0.093853 0.096858 0.178682 0.104430 0.120626 0.143376 0.142231 0.142855 0.147059 0.072991 0.108457 0.105714 0.074539 0.092956 0.093359 0.098924 0.122543 0.117752 0.131829
qa: -0.1000 -0.5419 -0.2959 -0.2717 -0.5537 -0.4842 -0.1728 -0.2350 0.0998 0.0613 0.1702 0.2439 -0.2945 -0.3082 -0.1041 0.0904 0.4825 -0.2203 -0.2638 0.4055 -0.1300 -0.1631 0.1344 0.0946 -0.2663 -0.2624 -0.1273 0.1050 0.0591 0.0992 0.1840 0.0900 0.0960 0.0939 0.0963 0.0939 0.0969 0.1787 0.1044 0.1206 0.1434 0.1422 0.1429 0.1471 0.0730 0.1085 0.1057 0.0745 0.0930 0.0934 0.0989 0.1225 0.1178 0.1318
va: 1.2035 1.9553 2.0832 2.1336 1.9394 1.9993 3.1895 3.1689 3.7894 3.8271 3.8272 4.1411 3.9499 3.9488 3.9317 3.4576 4.3521 4.0321 3.9012 4.1024 3.9618 3.9731 3.7776 3.8069 3.9125 3.9408 3.8561 1.0320 1.0231 1.0289 1.0288 1.0019 1.0040 1.0087 1.0036 1.0103 1.0035 1.0173 1.0282 1.0152 1.0022 1.0266 1.0064 1.0074 1.0214 1.0110 1.0068 1.0155 1.0170 1.0063 1.0056 0.9945 0.9917 0.9940
dispcorr: -0.035517793 hartree
energy: -1686.392680267030
dipole: 26.28425 -26.40607 -0.12183 -11.48405 9.58113 -1.90292 -11.40558 12.44994 1.04435
magnitude: 2.17408 au
magnitude: 5.52608 debye
