program: Orca
programVersion: 5.0.2
elementType: Cl O O O O O N N C C C C C C C C C C C C C C C C C C C H H H H H H H H H H H H H H H H H H H H H H H H H H H
charge: 0
multiplicity: 1
keywords: wb97x-d3
keywords: def2-TZVPP
keywords: def2/J RIJCOSX
keywords: DEFGRID2
keywords: scfconv7
keywords: smallprint printgap noloewdin
keywords: NOSOSCF
formula: C19H27ClN2O5
InChI: InChI=1/C19H27ClN2O5/c1-11(2)17(22-19(25)27-12(3)4)18(24)21-15(10-16(23)26-5)13-6-8-14(20)9-7-13/h6-9,11-12,15,17,21-22H,10H2,1-5H3
54 atoms
Cl -5.669115 1.047976 -0.046907
O  -0.244957 -2.405286 -1.939304
O  2.899697 1.826332 -0.5830
O  -0.816204 0.246162 3.277859
O  1.085597 1.494246 -1.888005
O  1.188503 0.284921 2.298935
N  0.59936 -1.498886 -0.057007
N  2.54599 -0.181419 -1.440312
C  1.810768 -1.195106 -2.154392
C  2.730681 -2.338646 -2.618851
C  -0.489012 -1.909459 0.801031
C  0.623337 -1.752488 -1.368861
C  3.340676 -3.131712 -1.467866
C  3.810056 -1.814957 -3.558801
C  -0.073851 -1.753207 2.274514
C  -1.777211 -1.159584 0.528917
C  2.095215 1.085706 -1.34127
C  -1.787246 0.137193 0.029827
C  -2.9896 -1.761184 0.850228
C  0.183777 -0.311985 2.620612
C  -2.979993 0.82325 -0.149106
C  -4.189935 -1.090556 0.680157
C  2.577254 3.221448 -0.385017
C  -4.173403 0.201527 0.178482
C  3.880666 3.907368 -0.039534
C  1.538632 3.379587 0.708399
C  -0.718544 1.642605 3.573533
H  1.382188 -0.744152 -3.052822
H  2.089225 -3.014855 -3.189291
H  -0.674707 -2.975481 0.648405
H  1.335561 -0.934542 0.339736
H  3.972837 -3.927831 -1.861235
H  2.584018 -3.604057 -0.840854
H  3.972753 -2.516777 -0.82361
H  4.539815 -1.193873 -3.037058
H  3.383444 -1.221122 -4.368879
H  4.353923 -2.646369 -4.007994
H  3.38946 -0.437244 -0.94783
H  -0.862589 -2.169165 2.898856
H  0.837173 -2.326634 2.453475
H  -0.862436 0.63414 -0.233664
H  -3.001855 -2.772482 1.238998
H  -2.971288 1.831241 -0.540818
H  -5.124548 -1.573505 0.931109
H  2.193791 3.630707 -1.321966
H  4.614643 3.801278 -0.838471
H  4.309464 3.511236 0.882077
H  3.70258 4.972285 0.106287
H  1.287684 4.434812 0.813447
H  0.615253 2.847002 0.483153
H  1.918221 3.030442 1.668595
H  0.152336 1.860608 4.19069
H  -0.678433 2.236644 2.660425
H  -1.620431 1.892681 4.124083
elementType: Cl O N C H
totalener: -1686.35946734 hartree
nucrepener: 2869.62267443 hartree
electener: -4555.98214177 hartree
oneelecener: -8015.74090732 hartree
twoeener: 3459.75876555 hartree
cpcmener: -0.05903635 hartree
kineticenergy: 1680.31619655 hartree
xcener: -138.346156229868 hartree
chargesum: 0.0000000
charge: -0.100708 -0.558644 -0.333797 -0.271182 -0.553034 -0.484284 -0.192133 -0.258356 0.118730 0.067117 0.168818 0.269129 -0.304627 -0.304799 -0.128381 -0.021976 0.515761 -0.151715 -0.197546 0.417162 -0.186573 -0.160853 0.185512 0.126955 -0.260694 -0.284531 -0.131626 0.109707 0.050262 0.108207 0.184778 0.101644 0.094056 0.085813 0.085742 0.097185 0.099828 0.187184 0.111977 0.126736 0.136038 0.145550 0.141581 0.143994 0.066067 0.097697 0.090228 0.092382 0.111032 0.086768 0.083786 0.126630 0.115304 0.136100
qa: -0.1007 -0.5586 -0.3338 -0.2712 -0.5530 -0.4843 -0.1921 -0.2584 0.1187 0.0671 0.1688 0.2691 -0.3046 -0.3048 -0.1284 -0.0220 0.5158 -0.1517 -0.1975 0.4172 -0.1866 -0.1609 0.1855 0.1270 -0.2607 -0.2845 -0.1316 0.1097 0.0503 0.1082 0.1848 0.1016 0.0941 0.0858 0.0857 0.0972 0.0998 0.1872 0.1120 0.1267 0.1360 0.1456 0.1416 0.1440 0.0661 0.0977 0.0902 0.0924 0.1110 0.0868 0.0838 0.1266 0.1153 0.1361
va: 1.2037 1.9569 2.0887 2.1318 1.9442 2.0099 3.1909 3.1795 3.7992 3.7914 3.8030 4.2010 3.9463 3.9434 3.8982 3.4875 4.2979 3.8942 4.0235 4.0936 4.0599 3.9947 3.8014 3.7924 3.9429 3.9026 3.8517 1.0378 1.0339 1.0141 1.0403 1.0033 1.0118 1.0033 1.0054 1.0035 1.0039 1.0165 1.0271 1.0186 1.0082 1.0014 1.0083 1.0054 1.0230 1.0079 1.0061 1.0048 1.0097 1.0060 1.0124 0.9936 0.9869 0.9962
dispcorr: -0.033067174 hartree
energy: -1686.392534511187
dipole: 41.27866 -38.96340 2.31526 1.45932 -1.51912 -0.05980 -0.50660 3.18348 2.67688
magnitude: 3.53973 au
magnitude: 8.99727 debye
