program: Orca
programVersion: 5.0.2
elementType: Cl O O O O O N N C C C C C C C C C C C C C C C C C C C H H H H H H H H H H H H H H H H H H H H H H H H H H H
charge: 0
multiplicity: 1
keywords: wb97x-d3
keywords: def2-TZVPP
keywords: def2/J RIJCOSX
keywords: DEFGRID2
keywords: scfconv7
keywords: smallprint printgap noloewdin
keywords: NOSOSCF
formula: C19H27ClN2O5
InChI: InChI=1/C19H27ClN2O5/c1-11(2)17(22-19(25)27-12(3)4)18(24)21-15(10-16(23)26-5)13-6-8-14(20)9-7-13/h6-9,11-12,15,17,21-22H,10H2,1-5H3
54 atoms
Cl -5.8210 0.893189 -0.222971
O  -0.220698 -2.352094 -1.963148
O  3.013956 1.736429 -0.313094
O  -0.995403 0.258565 3.402554
O  1.252215 1.596615 -1.716926
O  0.826385 0.530996 2.147723
N  0.545976 -1.431285 -0.053629
N  2.593834 -0.187835 -1.312653
C  1.832854 -1.124214 -2.101943
C  2.719152 -2.266582 -2.629193
C  -0.553346 -1.857917 0.778728
C  0.61731 -1.692264 -1.364243
C  3.272776 -3.157044 -1.521352
C  3.834973 -1.723603 -3.513287
C  -0.193909 -1.638738 2.258313
C  -1.861415 -1.16457 0.453581
C  2.211761 1.098863 -1.160921
C  -3.057445 -1.800325 0.77144
C  -1.909549 0.116064 -0.084491
C  -0.051027 -0.175755 2.590569
C  -4.278001 -1.17722 0.568432
C  -3.123865 0.754261 -0.296214
C  2.771573 3.135265 -0.050917
C  -4.299723 0.102314 0.035865
C  3.443785 3.981681 -1.112892
C  3.306175 3.405886 1.338392
C  -0.98487 1.644678 3.749804
H  1.430127 -0.596965 -2.970897
H  2.064916 -2.878616 -3.255049
H  -0.696613 -2.934472 0.651006
H  1.269999 -0.86998 0.366734
H  3.943648 -2.621017 -0.845503
H  3.851795 -3.974453 -1.953465
H  2.484171 -3.609165 -0.917682
H  4.379799 -2.543737 -3.983241
H  4.559668 -1.135682 -2.946825
H  3.442334 -1.089438 -4.310466
H  3.415435 -0.506857 -0.820089
H  -0.962954 -2.102602 2.873768
H  0.75322 -2.138402 2.47748
H  -3.042869 -2.802406 1.184375
H  -0.999975 0.636574 -0.356634
H  -5.198138 -1.687933 0.819093
H  -3.144308 1.750108 -0.718294
H  1.694525 3.315993 -0.061296
H  3.054554 3.769832 -2.109329
H  4.5234 3.820943 -1.121732
H  3.265478 5.038631 -0.911302
H  4.379292 3.216925 1.40397
H  3.135899 4.451314 1.596826
H  2.799048 2.794015 2.085732
H  -0.073357 1.916431 4.282461
H  -1.092653 2.275246 2.867072
H  -1.840085 1.794213 4.402885
elementType: Cl O N C H
totalener: -1686.36785734 hartree
nucrepener: 2843.19883179 hartree
electener: -4529.56668914 hartree
oneelecener: -7963.00049275 hartree
twoeener: 3433.43380361 hartree
cpcmener: -0.04679387 hartree
kineticenergy: 1680.30771038 hartree
xcener: -138.339926002680 hartree
chargesum: -0.0000000
charge: -0.099865 -0.519335 -0.333172 -0.267431 -0.524497 -0.471156 -0.193727 -0.265559 0.124726 0.064808 0.170245 0.239830 -0.302989 -0.303341 -0.138300 0.010200 0.505409 -0.205948 -0.169902 0.413618 -0.154945 -0.183946 0.151545 0.119727 -0.260257 -0.247188 -0.126846 0.109276 0.048934 0.106286 0.178840 0.082913 0.100678 0.094915 0.098162 0.083095 0.097352 0.182912 0.106789 0.125231 0.140875 0.147046 0.141039 0.140259 0.067223 0.094915 0.087898 0.096457 0.088438 0.090588 0.090811 0.120124 0.116711 0.130529
qa: -0.0999 -0.5193 -0.3332 -0.2674 -0.5245 -0.4712 -0.1937 -0.2656 0.1247 0.0648 0.1702 0.2398 -0.3030 -0.3033 -0.1383 0.0102 0.5054 -0.2059 -0.1699 0.4136 -0.1549 -0.1839 0.1515 0.1197 -0.2603 -0.2472 -0.1268 0.1093 0.0489 0.1063 0.1788 0.0829 0.1007 0.0949 0.0982 0.0831 0.0974 0.1829 0.1068 0.1252 0.1409 0.1470 0.1410 0.1403 0.0672 0.0949 0.0879 0.0965 0.0884 0.0906 0.0908 0.1201 0.1167 0.1305
va: 1.2045 2.0094 2.0817 2.1358 1.9790 2.0172 3.1673 3.1656 3.7883 3.7935 3.8068 4.2547 3.9451 3.9458 3.8908 3.4716 4.3062 4.0382 3.9259 4.0932 3.9963 4.0706 3.8296 3.8040 3.9190 3.9306 3.8609 1.0362 1.0357 1.0133 1.0475 1.0032 1.0039 1.0111 1.0040 1.0070 1.0035 1.0196 1.0278 1.0153 1.0030 1.0177 1.0063 1.0079 1.0239 1.0156 1.0073 1.0064 1.0069 1.0059 1.0167 0.9931 0.9927 0.9946
dispcorr: -0.031442193 hartree
energy: -1686.399299537879
dipole: 44.07464 -41.85647 2.21817 2.01715 -2.21870 -0.20155 -0.61323 3.31953 2.70629
magnitude: 3.50498 au
magnitude: 8.90896 debye
