program: Orca
programVersion: 5.0.2
elementType: Cl O O O O O N N C C C C C C C C C C C C C C C C C C C H H H H H H H H H H H H H H H H H H H H H H H H H H H
charge: 0
multiplicity: 1
keywords: wb97x-d3
keywords: def2-TZVPP
keywords: def2/J RIJCOSX
keywords: DEFGRID2
keywords: scfconv7
keywords: smallprint printgap noloewdin
keywords: NOSOSCF
formula: C19H27ClN2O5
InChI: InChI=1/C19H27ClN2O5/c1-11(2)17(22-19(25)27-12(3)4)18(24)21-15(10-16(23)26-5)13-6-8-14(20)9-7-13/h6-9,11-12,15,17,21-22H,10H2,1-5H3
54 atoms
Cl -6.201821 -2.361747 -0.962795
O  -0.820562 0.838615 -1.660022
O  4.037393 0.070614 0.454367
O  0.409839 3.258978 1.885728
O  2.722991 1.741475 -0.313822
O  1.016475 1.240397 2.613924
N  0.038071 -0.244785 0.125884
N  2.496456 -0.380398 -1.066188
C  1.370641 -0.075569 -1.91359
C  1.118223 -1.187052 -2.947474
C  -1.044577 0.032833 1.05495
C  0.092432 0.222779 -1.128044
C  0.679237 -2.508627 -2.325455
C  2.332029 -1.375579 -3.849915
C  -1.076313 1.506726 1.444772
C  -2.364138 -0.514593 0.546087
C  3.06858 0.575499 -0.303944
C  -3.483571 0.270338 0.303637
C  -2.45911 -1.886207 0.319717
C  0.23484 1.956726 2.035801
C  -4.668679 -0.290296 -0.154859
C  -3.628944 -2.462909 -0.143835
C  4.741809 0.945569 1.36145
C  -4.730347 -1.653839 -0.380134
C  5.894404 1.61566 0.641929
C  5.196272 0.081816 2.517524
C  1.567001 3.851522 2.475185
H  1.586184 0.8394 -2.472873
H  0.296117 -0.820425 -3.567937
H  -0.796893 -0.538527 1.951616
H  0.836361 -0.739422 0.490185
H  0.51191 -3.250501 -3.107549
H  -0.254797 -2.415239 -1.769755
H  1.429532 -2.926091 -1.649438
H  2.088314 -2.044908 -4.676136
H  3.178442 -1.814436 -3.317856
H  2.663124 -0.428755 -4.280604
H  2.84349 -1.326283 -1.007976
H  -1.341723 2.146123 0.603112
H  -1.843006 1.666487 2.210806
H  -3.456191 1.340305 0.460614
H  -1.603796 -2.524196 0.508237
H  -5.528026 0.340023 -0.34046
H  -3.679321 -3.530217 -0.312724
H  4.049666 1.702649 1.735657
H  6.434259 2.262312 1.334752
H  5.551773 2.237333 -0.185796
H  6.600154 0.879678 0.25247
H  5.715059 0.698995 3.251424
H  4.349529 -0.386732 3.020694
H  5.884757 -0.700524 2.192676
H  1.500459 4.914161 2.257051
H  1.58499 3.70848 3.555979
H  2.485134 3.455903 2.041643
elementType: Cl O N C H
totalener: -1686.36536430 hartree
nucrepener: 2816.04846321 hartree
electener: -4502.41382750 hartree
oneelecener: -7908.80628991 hartree
twoeener: 3406.39246240 hartree
cpcmener: -0.04821808 hartree
kineticenergy: 1680.31234421 hartree
xcener: -138.342875012354 hartree
chargesum: -0.0000000
charge: -0.100581 -0.512754 -0.334098 -0.276540 -0.528017 -0.468603 -0.167189 -0.261745 0.118916 0.066528 0.194721 0.226873 -0.305562 -0.299557 -0.089149 0.063071 0.506981 -0.207342 -0.277026 0.368520 -0.154242 -0.150875 0.166575 0.102913 -0.263531 -0.251321 -0.128167 0.109726 0.052075 0.111449 0.180100 0.101968 0.090738 0.084712 0.097845 0.083024 0.096580 0.180870 0.104465 0.131588 0.138249 0.143118 0.141019 0.141624 0.050609 0.097018 0.095437 0.089929 0.090910 0.095413 0.092191 0.131568 0.117553 0.111425
qa: -0.1006 -0.5128 -0.3341 -0.2765 -0.5280 -0.4686 -0.1672 -0.2617 0.1189 0.0665 0.1947 0.2269 -0.3056 -0.2996 -0.0891 0.0631 0.5070 -0.2073 -0.2770 0.3685 -0.1542 -0.1509 0.1666 0.1029 -0.2635 -0.2513 -0.1282 0.1097 0.0521 0.1114 0.1801 0.1020 0.0907 0.0847 0.0978 0.0830 0.0966 0.1809 0.1045 0.1316 0.1382 0.1431 0.1410 0.1416 0.0506 0.0970 0.0954 0.0899 0.0909 0.0954 0.0922 0.1316 0.1176 0.1114
va: 1.2042 2.0165 2.0848 2.1316 1.9753 2.0282 3.1047 3.1699 3.7962 3.7821 3.7099 4.2532 3.9566 3.9461 3.8463 3.5684 4.3129 3.9984 4.0421 4.1735 4.0252 4.0012 3.8575 3.8254 3.9181 3.9349 3.8785 1.0368 1.0330 1.0171 1.0190 1.0053 1.0067 1.0037 1.0038 1.0051 1.0042 1.0194 1.0369 1.0057 1.0077 1.0046 1.0070 1.0063 1.0104 1.0060 1.0155 1.0075 1.0060 1.0097 1.0067 0.9954 0.9935 0.9831
dispcorr: -0.031615627 hartree
energy: -1686.396979925300
dipole: 46.44921 -44.38690 2.06231 5.00792 -6.03370 -1.02577 0.91064 0.33351 1.24415
magnitude: 2.61787 au
magnitude: 6.65409 debye
