program: Orca
programVersion: 5.0.2
elementType: Cl O O O O O N N C C C C C C C C C C C C C C C C C C C H H H H H H H H H H H H H H H H H H H H H H H H H H H
charge: 0
multiplicity: 1
keywords: wb97x-d3
keywords: def2-TZVPP
keywords: def2/J RIJCOSX
keywords: DEFGRID2
keywords: scfconv7
keywords: smallprint printgap noloewdin
keywords: NOSOSCF
formula: C19H27ClN2O5
InChI: InChI=1/C19H27ClN2O5/c1-11(2)17(22-19(25)27-12(3)4)18(24)21-15(10-16(23)26-5)13-6-8-14(20)9-7-13/h6-9,11-12,15,17,21-22H,10H2,1-5H3
54 atoms
Cl -5.583067 1.880785 0.127906
O  0.157022 -2.895762 -1.916313
O  2.878432 1.827234 -0.536133
O  0.713282 -0.230641 2.41752
O  1.657217 1.424156 -2.391957
O  -1.142864 -0.440486 3.63755
N  0.286484 -1.460561 -0.170399
N  2.493879 -0.262328 -1.113562
C  1.990493 -1.358288 -1.901891
C  3.066753 -2.435024 -2.127275
C  -0.89517 -1.893557 0.5281
C  0.715758 -1.981183 -1.326896
C  3.517887 -3.1013 -0.83098
C  4.250003 -1.857095 -2.89178
C  -0.596288 -2.138628 2.021483
C  -2.060391 -0.933866 0.370082
C  2.291837 1.03569 -1.432586
C  -3.322135 -1.328178 0.810545
C  -1.911601 0.343091 -0.156523
C  -0.39521 -0.8618 2.792504
C  -4.408964 -0.474436 0.736808
C  -2.990934 1.214304 -0.234053
C  2.787861 3.258524 -0.697326
C  -4.231202 0.799275 0.216878
C  3.913447 3.835325 0.134965
C  1.429543 3.765873 -0.254956
C  1.006485 1.029657 3.02254
H  1.707425 -0.963959 -2.881123
H  2.60159 -3.19888 -2.754689
H  -1.182885 -2.859508 0.11009
H  0.819184 -0.701546 0.226393
H  4.030083 -2.407225 -0.159797
H  4.224675 -3.903564 -1.047017
H  2.687698 -3.546684 -0.279472
H  4.790729 -1.111219 -2.306027
H  3.932544 -1.383065 -3.82253
H  4.959045 -2.645065 -3.149932
H  3.104639 -0.463689 -0.334817
H  -1.432718 -2.674498 2.466827
H  0.28828 -2.773939 2.107035
H  -3.467888 -2.322176 1.216843
H  -0.952352 0.680997 -0.527715
H  -5.381293 -0.801324 1.080246
H  -2.855853 2.206073 -0.644555
H  2.952448 3.507089 -1.749026
H  4.885647 3.462666 -0.190053
H  3.789435 3.599922 1.193936
H  3.925322 4.920595 0.034643
H  1.402192 4.853099 -0.338803
H  0.620074 3.372875 -0.869288
H  1.231699 3.507476 0.787263
H  1.922866 1.376654 2.552661
H  0.210479 1.752516 2.843983
H  1.169407 0.925654 4.095374
elementType: Cl O N C H
totalener: -1686.36574379 hartree
nucrepener: 2832.56553091 hartree
electener: -4518.93127470 hartree
oneelecener: -7939.47769275 hartree
twoeener: 3420.54641806 hartree
cpcmener: -0.04902476 hartree
kineticenergy: 1680.31465267 hartree
xcener: -138.341565085214 hartree
chargesum: -0.0000000
charge: -0.098514 -0.528631 -0.333137 -0.285793 -0.517980 -0.436663 -0.194753 -0.268342 0.091905 0.062337 0.141897 0.277799 -0.299443 -0.310431 -0.135381 0.035820 0.508501 -0.218796 -0.159077 0.390162 -0.146440 -0.176302 0.155724 0.120634 -0.259063 -0.267926 -0.126720 0.112800 0.047925 0.100294 0.189367 0.081651 0.100576 0.095013 0.082322 0.098360 0.101177 0.181170 0.107408 0.119550 0.140832 0.139293 0.141672 0.138338 0.076153 0.097360 0.089626 0.092348 0.103819 0.094224 0.083212 0.112212 0.121461 0.130451
qa: -0.0985 -0.5286 -0.3331 -0.2858 -0.5180 -0.4367 -0.1948 -0.2683 0.0919 0.0623 0.1419 0.2778 -0.2994 -0.3104 -0.1354 0.0358 0.5085 -0.2188 -0.1591 0.3902 -0.1464 -0.1763 0.1557 0.1206 -0.2591 -0.2679 -0.1267 0.1128 0.0479 0.1003 0.1894 0.0817 0.1006 0.0950 0.0823 0.0984 0.1012 0.1812 0.1074 0.1196 0.1408 0.1393 0.1417 0.1383 0.0762 0.0974 0.0896 0.0923 0.1038 0.0942 0.0832 0.1122 0.1215 0.1305
va: 1.2060 2.0021 2.0660 2.0969 1.9885 2.0623 3.1822 3.1731 3.8139 3.8118 3.7342 4.2623 3.9417 3.9450 3.8758 3.6275 4.3099 4.0372 3.9296 4.1333 3.9872 4.0538 3.8112 3.8110 3.9519 3.9023 3.8527 1.0402 1.0386 1.0431 1.0284 1.0036 1.0042 1.0097 1.0078 1.0030 1.0043 1.0198 1.0225 1.0238 1.0027 1.0039 1.0056 1.0101 1.0199 1.0077 1.0026 1.0056 1.0086 1.0190 1.0055 1.0036 0.9907 0.9952
dispcorr: -0.031720757 hartree
energy: -1686.397464543125
dipole: 45.11523 -42.13295 2.98228 -0.45413 0.90688 0.45275 -1.68607 3.38469 1.69862
magnitude: 3.46183 au
magnitude: 8.79928 debye
